{"text_format":"3","workbook":"xlsx","n_sheets":6,"sheets":["competition","practice","info","totals","Fertilizers","Pesticide, Chemicals"],"not_rendered":{"defined_names":1},"read":"whole","date_system":"1900"}

{"sheet":"competition","index":0,"n_rows":101,"n_cols":15,"rows_kept":101,"hidden":true,"merged":[[1,0,4,0],[5,0,8,0],[9,0,12,0],[13,0,16,0],[17,0,20,0],[21,0,24,0],[25,0,28,0],[29,0,32,0],[33,0,36,0],[37,0,40,0],[41,0,44,0],[45,0,48,0],[49,0,52,0],[53,0,56,0],[57,0,60,0],[61,0,64,0],[65,0,68,0],[69,0,72,0],[73,0,76,0],[77,0,80,0],[81,0,84,0],[85,0,88,0],[89,0,92,0],[93,0,96,0]]}
["month","sites","acres","app type","product","reason","rate/acre","unit","app amount","purchase package","purchase unit","purchase amount","rounded","cost per unit","total cost"]
["january (1-15)","baseball",{"$f":"IFERROR(VLOOKUP(B2:B97,info!$E$7:$F$15,2,FALSE),\"\")","v":20.07},"herbicide","xonerate","poa control",4,"oz",{"$f":"IFERROR(C2*G2, \" \")","v":80.28},12,"oz",{"$f":"IFERROR(I2/J2, \"\")","v":6.69},7,{"v":410,"d":"$410.00"},{"$f":"N2*M2","v":{"v":2870,"d":"$2,870.00"}}]
[null,null,{"$f":"IFERROR(VLOOKUP(B3:B98,info!$E$7:$F$15,2,FALSE),\"\")","v":""},{"$nulls":5}," ",null,null,{"$f":"IFERROR(I3/J3, \"\")","v":""},null,null,0]
[null,null,{"$f":"IFERROR(VLOOKUP(B4:B99,info!$E$7:$F$15,2,FALSE),\"\")","v":""},{"$nulls":5}," ",null,null,"",null,null,0]
[null,null,{"$f":"IFERROR(VLOOKUP(B5:B100,info!$E$7:$F$15,2,FALSE),\"\")","v":""},{"$nulls":5}," ",null,null,"",null,null,0]
["january (16-31)","baseball & softball",{"$f":"IFERROR(VLOOKUP(B6:B101,info!$E$7:$F$15,2,FALSE),\"\")","v":25.67},"fertilizer","uflexx 46-0-0","foliar fert",20,"lb",513.4000000000001,50,"lb",{"v":10.268000000000002,"d":"10.27"},12,{"v":15,"d":"$15.00"},{"v":180,"d":"$180.00"}]
[null,"baseball & softball",{"$f":"IFERROR(VLOOKUP(B7:B102,info!$E$7:$F$15,2,FALSE),\"\")","v":25.67},"fertilizer","12-0-0 w/6%fe 3%mn","foliar fert",80,"oz",2053.6000000000004,128,"oz",{"v":16.043750000000003,"d":"16.04"},16,{"v":40,"d":"$40.00"},{"v":640,"d":"$640.00"}]
[null,null,{"$f":"IFERROR(VLOOKUP(B8:B103,info!$E$7:$F$15,2,FALSE),\"\")","v":""},{"$nulls":5}," ",null,null,"",null,null,0]
[null,null,{"$f":"IFERROR(VLOOKUP(B9:B104,info!$E$7:$F$15,2,FALSE),\"\")","v":""},{"$nulls":5}," ",null,null,"",null,null,0]
["february","baseball",20.07,"herbicide","xonerate","poa control",4,"oz",80.28,12,"oz",6.69,7,{"v":410,"d":"$410.00"},{"v":2870,"d":"$2,870.00"}]
[null,null,{"$f":"IFERROR(VLOOKUP(B11:B106,info!$E$7:$F$15,2,FALSE),\"\")","v":""},{"$nulls":5}," ",null,null,"",null,null,0]
[null,null,{"$f":"IFERROR(VLOOKUP(B12:B107,info!$E$7:$F$15,2,FALSE),\"\")","v":""},{"$nulls":5}," ",null,null,"",null,null,0]
[null,null,{"$f":"IFERROR(VLOOKUP(B13:B108,info!$E$7:$F$15,2,FALSE),\"\")","v":""},{"$nulls":5}," ",null,null,"",null,null,0]
["february","baseball & softball",{"$f":"IFERROR(VLOOKUP(B14:B109,info!$E$7:$F$15,2,FALSE),\"\")","v":25.67},"fertilizer","umaxx 46-0-0","fertilizer",100,"lb",2567,50,"lb",51.34,55,{"v":15,"d":"$15.00"},{"v":825,"d":"$825.00"}]
[null,null,{"$f":"IFERROR(VLOOKUP(B15:B110,info!$E$7:$F$15,2,FALSE),\"\")","v":""},{"$nulls":5}," ",null,null,"",null,null,0]
[null,null,{"$f":"IFERROR(VLOOKUP(B16:B111,info!$E$7:$F$15,2,FALSE),\"\")","v":""},{"$nulls":5}," ",null,null,"",null,null,0]
[null,null,{"$f":"IFERROR(VLOOKUP(B17:B112,info!$E$7:$F$15,2,FALSE),\"\")","v":""},{"$nulls":5}," ",null,null,"",null,null,0]
["march","all competition",{"$f":"IFERROR(VLOOKUP(B18:B113,info!$E$7:$F$15,2,FALSE),\"\")","v":43.08},"herbicide w/fert","22-0-18 w/oxidiazon","crabgrass prevention",250,"lb",10770,50,"lb",{"v":215.4,"d":"215.40"},220,{"v":35,"d":"$35.00"},{"v":7700,"d":"$7,700.00"}]
[null,null,{"$f":"IFERROR(VLOOKUP(B19:B114,info!$E$7:$F$15,2,FALSE),\"\")","v":""},{"$nulls":5}," ",null,null,"",null,null,0]
[null,null,{"$f":"IFERROR(VLOOKUP(B20:B115,info!$E$7:$F$15,2,FALSE),\"\")","v":""},{"$nulls":5}," ",null,null,"",null,null,0]
[null,null,{"$f":"IFERROR(VLOOKUP(B21:B116,info!$E$7:$F$15,2,FALSE),\"\")","v":""},{"$nulls":5}," ",null,null,"",null,null,0]
["march","baseball & softball",{"$f":"IFERROR(VLOOKUP(B22:B117,info!$E$7:$F$15,2,FALSE),\"\")","v":25.67},"herbicide","trimec","broadleaf control",40,"oz",1026.8000000000002,128,"oz",{"v":8.021875000000001,"d":"8.02"},10,{"v":25,"d":"$25.00"},{"v":250,"d":"$250.00"}]
[null,null,{"$f":"IFERROR(VLOOKUP(B23:B118,info!$E$7:$F$15,2,FALSE),\"\")","v":""},{"$nulls":5}," ",null,null,"",null,null,0]
[null,null,{"$f":"IFERROR(VLOOKUP(B24:B119,info!$E$7:$F$15,2,FALSE),\"\")","v":""},{"$nulls":5}," ",null,null,"",null,null,0]
[null,null,{"$f":"IFERROR(VLOOKUP(B25:B120,info!$E$7:$F$15,2,FALSE),\"\")","v":""},{"$nulls":5}," ",null,null,"",null,null,0]
["april",null,{"$f":"IFERROR(VLOOKUP(B26:B121,info!$E$7:$F$15,2,FALSE),\"\")","v":""},{"$nulls":5}," ",null,null,"",null,null,0]
[null,null,{"$f":"IFERROR(VLOOKUP(B27:B122,info!$E$7:$F$15,2,FALSE),\"\")","v":""},{"$nulls":5}," ",null,null,"",null,null,0]
[null,null,{"$f":"IFERROR(VLOOKUP(B28:B123,info!$E$7:$F$15,2,FALSE),\"\")","v":""},{"$nulls":5}," ",null,null,"",null,null,0]
[null,null,{"$f":"IFERROR(VLOOKUP(B29:B124,info!$E$7:$F$15,2,FALSE),\"\")","v":""},{"$nulls":5}," ",null,null,"",null,null,0]
["april","all competition",{"$f":"IFERROR(VLOOKUP(B30:B125,info!$E$7:$F$15,2,FALSE),\"\")","v":43.08},"fertilizer","umaxx 46-0-0","fertilizer",100,"lb",4308,50,"lb",86.16,100,{"v":30,"d":"$30.00"},{"v":3000,"d":"$3,000.00"}]
[null,null,{"$f":"IFERROR(VLOOKUP(B31:B126,info!$E$7:$F$15,2,FALSE),\"\")","v":""},{"$nulls":5}," ",null,null,"",null,null,0]
[null,null,{"$f":"IFERROR(VLOOKUP(B32:B127,info!$E$7:$F$15,2,FALSE),\"\")","v":""},{"$nulls":5}," ",null,null,"",null,null,0]
[null,null,{"$f":"IFERROR(VLOOKUP(B33:B128,info!$E$7:$F$15,2,FALSE),\"\")","v":""},{"$nulls":5}," ",null,null,"",null,null,0]
["may","all competition",{"$f":"IFERROR(VLOOKUP(B34:B129,info!$E$7:$F$15,2,FALSE),\"\")","v":43.08},"insecticide","fipronil","fire ants / mole crickets",80,"lb",3446.3999999999996,30,"lb",{"v":114.87999999999998,"d":"114.88"},120,{"v":59.5,"d":"$59.50"},{"v":7140,"d":"$7,140.00"}]
[null,null,{"$f":"IFERROR(VLOOKUP(B35:B130,info!$E$7:$F$15,2,FALSE),\"\")","v":""},{"$nulls":5}," ",null,null,"",null,null,0]
[null,null,{"$f":"IFERROR(VLOOKUP(B36:B131,info!$E$7:$F$15,2,FALSE),\"\")","v":""},{"$nulls":5}," ",null,null,"",null,null,0]
[null,null,{"$f":"IFERROR(VLOOKUP(B37:B132,info!$E$7:$F$15,2,FALSE),\"\")","v":""},{"$nulls":5}," ",null,null,"",null,null,0]
["may","all competition",{"$f":"IFERROR(VLOOKUP(B38:B133,info!$E$7:$F$15,2,FALSE),\"\")","v":43.08},"herbicide","certainty","ryegrass / nutsedge",1.25,"oz",53.849999999999994,12.5,"oz",{"v":4.308,"d":"4.31"},5,{"v":850,"d":"$850.00"},{"v":4250,"d":"$4,250.00"}]
[null,null,{"$f":"IFERROR(VLOOKUP(B39:B134,info!$E$7:$F$15,2,FALSE),\"\")","v":""},{"$nulls":5}," ",null,null,"",null,null,0]
[null,null,{"$f":"IFERROR(VLOOKUP(B40:B135,info!$E$7:$F$15,2,FALSE),\"\")","v":""},{"$nulls":5}," ",null,null,"",null,null,0]
[null,null,{"$f":"IFERROR(VLOOKUP(B41:B136,info!$E$7:$F$15,2,FALSE),\"\")","v":""},{"$nulls":5}," ",null,null,"",null,null,0]
["june","all competition",{"$f":"IFERROR(VLOOKUP(B42:B137,info!$E$7:$F$15,2,FALSE),\"\")","v":43.08},"aerification","sand","dilute thatch",33,"ton",1421.6399999999999,22,"ton",{"v":64.61999999999999,"d":"64.62"},66,{"v":450,"d":"$450.00"},{"v":29700,"d":"$29,700.00"}]
[null,null,{"$f":"IFERROR(VLOOKUP(B43:B138,info!$E$7:$F$15,2,FALSE),\"\")","v":""},{"$nulls":5}," ",null,null,"",null,null,0]
[null,null,{"$f":"IFERROR(VLOOKUP(B44:B139,info!$E$7:$F$15,2,FALSE),\"\")","v":""},{"$nulls":5}," ",null,null,"",null,null,0]
[null,null,{"$f":"IFERROR(VLOOKUP(B45:B140,info!$E$7:$F$15,2,FALSE),\"\")","v":""},{"$nulls":5}," ",null,null,"",null,null,0]
["june","all competition",{"$f":"IFERROR(VLOOKUP(B46:B141,info!$E$7:$F$15,2,FALSE),\"\")","v":43.08},"insecticide w/fert","21-14-14 w/acelepryn","armyworm control",300,"lb",12924,50,"lb",258.48,275,{"v":40,"d":"$40.00"},{"v":11000,"d":"$11,000.00"}]
[null,null,{"$f":"IFERROR(VLOOKUP(B47:B142,info!$E$7:$F$15,2,FALSE),\"\")","v":""},{"$nulls":5}," ",null,null,"",null,null,0]
[null,null,{"$f":"IFERROR(VLOOKUP(B48:B143,info!$E$7:$F$15,2,FALSE),\"\")","v":""},{"$nulls":5}," ",null,null,"",null,null,0]
[null,null,{"$f":"IFERROR(VLOOKUP(B49:B144,info!$E$7:$F$15,2,FALSE),\"\")","v":""},{"$nulls":5}," ",null,null,"",null,null,0]
["july","all competition",43.08,"herbicide","trimec","broadleaf control",40,"oz",1723.1999999999998,128,"oz",{"v":13.462499999999999,"d":"13.46"},15,{"v":25,"d":"$25.00"},{"v":375,"d":"$375.00"}]
[null,"all competition",43.08,"herbicide","msma","grassy weeds",40,"oz",1723.1999999999998,128,"oz",{"v":13.462499999999999,"d":"13.46"},15,{"v":25,"d":"$25.00"},{"v":375,"d":"$375.00"}]
[null,null,{"$f":"IFERROR(VLOOKUP(B52:B147,info!$E$7:$F$15,2,FALSE),\"\")","v":""},{"$nulls":5}," ",null,null,"",null,null,0]
[null,null,{"$f":"IFERROR(VLOOKUP(B53:B148,info!$E$7:$F$15,2,FALSE),\"\")","v":""},{"$nulls":5}," ",null,null,"",null,null,0]
["july","all competition",{"$f":"IFERROR(VLOOKUP(B54:B149,info!$E$7:$F$15,2,FALSE),\"\")","v":43.08},"growth regulator","trinexepac-ethyl","bermuda regulation",10,"oz",430.79999999999995,128,"oz",{"v":3.3656249999999996,"d":"3.37"},4,{"v":300,"d":"$300.00"},{"v":1200,"d":"$1,200.00"}]
[null,null,{"$f":"IFERROR(VLOOKUP(B55:B150,info!$E$7:$F$15,2,FALSE),\"\")","v":""},{"$nulls":5}," ",null,null,"",null,null,0]
[null,null,{"$f":"IFERROR(VLOOKUP(B56:B151,info!$E$7:$F$15,2,FALSE),\"\")","v":""},{"$nulls":5}," ",null,null,"",null,null,0]
[null,null,{"$f":"IFERROR(VLOOKUP(B57:B152,info!$E$7:$F$15,2,FALSE),\"\")","v":""},{"$nulls":5}," ",null,null,"",null,null,0]
["august","all competition",43.08,"herbicide","certainty","nutsedge",1.25,"oz",53.849999999999994,12.5,"oz",{"v":4.308,"d":"4.31"},5,{"v":850,"d":"$850.00"},{"v":4250,"d":"$4,250.00"}]
[null,"all competition",43.08,"herbicide","msma","grassy weeds",80,"oz",3446.3999999999996,128,"oz",{"v":26.924999999999997,"d":"26.93"},30,{"v":25,"d":"$25.00"},{"v":750,"d":"$750.00"}]
[null,null,{"$f":"IFERROR(VLOOKUP(B60:B155,info!$E$7:$F$15,2,FALSE),\"\")","v":""},{"$nulls":5}," ",null,null,"",null,null,0]
{"$rows_left_out":42}
{"sheet":"practice","index":1,"n_rows":101,"n_cols":15,"rows_kept":101,"hidden":true,"merged":[[1,0,4,0],[5,0,8,0],[9,0,12,0],[13,0,16,0],[17,0,20,0],[21,0,24,0],[25,0,28,0],[29,0,32,0],[33,0,36,0],[37,0,40,0],[41,0,44,0],[45,0,48,0],[49,0,52,0],[53,0,56,0],[57,0,60,0],[61,0,64,0],[65,0,68,0],[69,0,72,0],[73,0,76,0],[77,0,80,0],[81,0,84,0],[85,0,88,0],[89,0,92,0],[93,0,96,0]]}
["month","sites","acres","app type","product","reason","rate/acre","unit","app amount","purchase package","purchase unit","purchase amount","rounded","cost per unit","total cost"]
["january (1-15)",{"$nulls":10},{"$f":"IFERROR(I2/J2, \"\")","v":""},null,null,{"$f":"N2*M2","v":0}]
[{"$nulls":11},{"$f":"IFERROR(I3/J3, \"\")","v":""},null,null,0]
[{"$nulls":11},"",null,null,0]
[{"$nulls":11},"",null,null,0]
["january (16-31)",{"$nulls":10},"",null,null,0]
[{"$nulls":11},"",null,null,0]
[{"$nulls":11},"",null,null,0]
[{"$nulls":11},"",null,null,0]
["february",null,{"$f":"IFERROR(VLOOKUP(B10:B105,info!$E$7:$F$15,2,FALSE),\"\")","v":""},{"$nulls":5},{"$f":"IFERROR(C10*G10, \" \")","v":" "},null,null,"",null,null,0]
[null,null,{"$f":"IFERROR(VLOOKUP(B11:B106,info!$E$7:$F$15,2,FALSE),\"\")","v":""},{"$nulls":5}," ",null,null,"",null,null,0]
[null,null,{"$f":"IFERROR(VLOOKUP(B12:B107,info!$E$7:$F$15,2,FALSE),\"\")","v":""},{"$nulls":5}," ",null,null,"",null,null,0]
[null,null,{"$f":"IFERROR(VLOOKUP(B13:B108,info!$E$7:$F$15,2,FALSE),\"\")","v":""},{"$nulls":5}," ",null,null,"",null,null,0]
["february",{"$nulls":10},"",null,null,0]
[null,"all practice",{"$f":"IFERROR(VLOOKUP(B15:B110,info!$E$7:$F$15,2,FALSE),\"\")","v":32.44},"herbicide w/fert","22-0-18 w/oxidiazon","fert + crabgrass prevention",250,"lb",8109.999999999999,50,"lb",{"v":162.2,"d":"162.20"},165,{"v":35,"d":"$35.00"},{"v":5775,"d":"$5,775.00"}]
[null,null,{"$f":"IFERROR(VLOOKUP(B16:B111,info!$E$7:$F$15,2,FALSE),\"\")","v":""},{"$nulls":5}," ",null,null,"",null,null,0]
[null,null,{"$f":"IFERROR(VLOOKUP(B17:B112,info!$E$7:$F$15,2,FALSE),\"\")","v":""},{"$nulls":5}," ",null,null,"",null,null,0]
["march",null,{"$f":"IFERROR(VLOOKUP(B18:B113,info!$E$7:$F$15,2,FALSE),\"\")","v":""},{"$nulls":5}," ",null,null,"",null,null,0]
[null,null,{"$f":"IFERROR(VLOOKUP(B19:B114,info!$E$7:$F$15,2,FALSE),\"\")","v":""},{"$nulls":5}," ",null,null,"",null,null,0]
[null,null,{"$f":"IFERROR(VLOOKUP(B20:B115,info!$E$7:$F$15,2,FALSE),\"\")","v":""},{"$nulls":5}," ",null,null,"",null,null,0]
[null,null,{"$f":"IFERROR(VLOOKUP(B21:B116,info!$E$7:$F$15,2,FALSE),\"\")","v":""},{"$nulls":5}," ",null,null,"",null,null,0]
["march","all practice",{"$f":"IFERROR(VLOOKUP(B22:B117,info!$E$7:$F$15,2,FALSE),\"\")","v":32.44},"fertilizer","21-0-0","fertilization",250,"lb",8109.999999999999,50,"lb",{"v":162.2,"d":"162.20"},165,{"v":15,"d":"$15.00"},{"v":2475,"d":"$2,475.00"}]
[null,null,{"$f":"IFERROR(VLOOKUP(B23:B118,info!$E$7:$F$15,2,FALSE),\"\")","v":""},{"$nulls":5}," ",null,null,"",null,null,0]
[null,null,{"$f":"IFERROR(VLOOKUP(B24:B119,info!$E$7:$F$15,2,FALSE),\"\")","v":""},{"$nulls":5}," ",null,null,"",null,null,0]
[null,null,{"$f":"IFERROR(VLOOKUP(B25:B120,info!$E$7:$F$15,2,FALSE),\"\")","v":""},{"$nulls":5}," ",null,null,"",null,null,0]
["april","all practice",{"$f":"IFERROR(VLOOKUP(B26:B121,info!$E$7:$F$15,2,FALSE),\"\")","v":32.44},"aerification","none","dilute thatch",0,null,0,0,null,"",null,0,0]
[null,null,{"$f":"IFERROR(VLOOKUP(B27:B122,info!$E$7:$F$15,2,FALSE),\"\")","v":""},{"$nulls":5}," ",null,null,"",null,null,0]
[null,null,{"$f":"IFERROR(VLOOKUP(B28:B123,info!$E$7:$F$15,2,FALSE),\"\")","v":""},{"$nulls":5}," ",null,null,"",null,null,0]
[null,null,{"$f":"IFERROR(VLOOKUP(B29:B124,info!$E$7:$F$15,2,FALSE),\"\")","v":""},{"$nulls":5}," ",null,null,"",null,null,0]
["april","all practice",{"$f":"IFERROR(VLOOKUP(B30:B125,info!$E$7:$F$15,2,FALSE),\"\")","v":32.44},"fertilizer","21-0-0","fertilization",250,"lb",8109.999999999999,50,"lb",{"v":162.2,"d":"162.20"},165,{"v":15,"d":"$15.00"},{"v":2475,"d":"$2,475.00"}]
[null,null,{"$f":"IFERROR(VLOOKUP(B31:B126,info!$E$7:$F$15,2,FALSE),\"\")","v":""},{"$nulls":5}," ",null,null,"",null,null,0]
[null,null,{"$f":"IFERROR(VLOOKUP(B32:B127,info!$E$7:$F$15,2,FALSE),\"\")","v":""},{"$nulls":5}," ",null,null,"",null,null,0]
[null,null,{"$f":"IFERROR(VLOOKUP(B33:B128,info!$E$7:$F$15,2,FALSE),\"\")","v":""},{"$nulls":5}," ",null,null,"",null,null,0]
["may","all practice",{"$f":"IFERROR(VLOOKUP(B34:B129,info!$E$7:$F$15,2,FALSE),\"\")","v":32.44},"insecticide","fipronil","fire ants / mole crickets",80,"lb",2595.2,30,"lb",{"v":86.50666666666666,"d":"86.51"},90,{"v":59.5,"d":"$59.50"},{"v":5355,"d":"$5,355.00"}]
[null,null,{"$f":"IFERROR(VLOOKUP(B35:B130,info!$E$7:$F$15,2,FALSE),\"\")","v":""},{"$nulls":5}," ",null,null,"",null,null,0]
[null,null,{"$f":"IFERROR(VLOOKUP(B36:B131,info!$E$7:$F$15,2,FALSE),\"\")","v":""},{"$nulls":5}," ",null,null,"",null,null,0]
[null,null,{"$f":"IFERROR(VLOOKUP(B37:B132,info!$E$7:$F$15,2,FALSE),\"\")","v":""},{"$nulls":5}," ",null,null,"",null,null,0]
["may","all practice",{"$f":"IFERROR(VLOOKUP(B38:B133,info!$E$7:$F$15,2,FALSE),\"\")","v":32.44},"herbicide","certainty","ryegrass / nutsedge",1.25,"oz",40.55,12.5,"oz",{"v":3.2439999999999998,"d":"3.24"},4,{"v":850,"d":"$850.00"},{"v":3400,"d":"$3,400.00"}]
[null,null,{"$f":"IFERROR(VLOOKUP(B39:B134,info!$E$7:$F$15,2,FALSE),\"\")","v":""},{"$nulls":5}," ",null,null,"",null,null,0]
[null,null,{"$f":"IFERROR(VLOOKUP(B40:B135,info!$E$7:$F$15,2,FALSE),\"\")","v":""},{"$nulls":5}," ",null,null,"",null,null,0]
[null,null,{"$f":"IFERROR(VLOOKUP(B41:B136,info!$E$7:$F$15,2,FALSE),\"\")","v":""},{"$nulls":5}," ",null,null,"",null,null,0]
["june",null,{"$f":"IFERROR(VLOOKUP(B42:B137,info!$E$7:$F$15,2,FALSE),\"\")","v":""},{"$nulls":5}," ",null,null,"",null,null,0]
[null,null,{"$f":"IFERROR(VLOOKUP(B43:B138,info!$E$7:$F$15,2,FALSE),\"\")","v":""},{"$nulls":5}," ",null,null,"",null,null,0]
[null,null,{"$f":"IFERROR(VLOOKUP(B44:B139,info!$E$7:$F$15,2,FALSE),\"\")","v":""},{"$nulls":5}," ",null,null,"",null,null,0]
[null,null,{"$f":"IFERROR(VLOOKUP(B45:B140,info!$E$7:$F$15,2,FALSE),\"\")","v":""},{"$nulls":5}," ",null,null,"",null,null,0]
["june","all practice",{"$f":"IFERROR(VLOOKUP(B46:B141,info!$E$7:$F$15,2,FALSE),\"\")","v":32.44},"insecticide w/fert","21-14-14 w/acelepryn","armyworm control",300,"lb",9732,50,"lb",194.64,200,{"v":40,"d":"$40.00"},{"v":8000,"d":"$8,000.00"}]
[null,null,{"$f":"IFERROR(VLOOKUP(B47:B142,info!$E$7:$F$15,2,FALSE),\"\")","v":""},{"$nulls":5}," ",null,null,"",null,null,0]
[null,null,{"$f":"IFERROR(VLOOKUP(B48:B143,info!$E$7:$F$15,2,FALSE),\"\")","v":""},{"$nulls":5}," ",null,null,"",null,null,0]
[null,null,{"$f":"IFERROR(VLOOKUP(B49:B144,info!$E$7:$F$15,2,FALSE),\"\")","v":""},{"$nulls":5}," ",null,null,"",null,null,0]
["july","all practice",{"$f":"IFERROR(VLOOKUP(B50:B145,info!$E$7:$F$15,2,FALSE),\"\")","v":32.44},"herbicide","msma","bahia / crab / dallis",80,"oz",2595.2,128,"oz",{"v":20.275,"d":"20.28"},20,{"v":23,"d":"$23.00"},{"v":460,"d":"$460.00"}]
[null,"all practice",{"$f":"IFERROR(VLOOKUP(B51:B146,info!$E$7:$F$15,2,FALSE),\"\")","v":32.44},"herbicide","trimec","broadleaf",40,"oz",1297.6,128,"oz",{"v":10.1375,"d":"10.14"},10,{"v":25,"d":"$25.00"},{"v":250,"d":"$250.00"}]
[null,null,{"$f":"IFERROR(VLOOKUP(B52:B147,info!$E$7:$F$15,2,FALSE),\"\")","v":""},{"$nulls":5}," ",null,null,"",null,null,0]
[null,null,{"$f":"IFERROR(VLOOKUP(B53:B148,info!$E$7:$F$15,2,FALSE),\"\")","v":""},{"$nulls":5}," ",null,null,"",null,null,0]
["july",null,{"$f":"IFERROR(VLOOKUP(B54:B149,info!$E$7:$F$15,2,FALSE),\"\")","v":""},{"$nulls":5}," ",null,null,"",null,null,0]
[null,null,{"$f":"IFERROR(VLOOKUP(B55:B150,info!$E$7:$F$15,2,FALSE),\"\")","v":""},{"$nulls":5}," ",null,null,"",null,null,0]
[null,null,{"$f":"IFERROR(VLOOKUP(B56:B151,info!$E$7:$F$15,2,FALSE),\"\")","v":""},{"$nulls":5}," ",null,null,"",null,null,0]
[null,null,{"$f":"IFERROR(VLOOKUP(B57:B152,info!$E$7:$F$15,2,FALSE),\"\")","v":""},{"$nulls":5}," ",null,null,"",null,null,0]
["august",null,{"$f":"IFERROR(VLOOKUP(B58:B153,info!$E$7:$F$15,2,FALSE),\"\")","v":""},{"$nulls":5}," ",null,null,"",null,null,0]
[null,"all practice",{"$f":"IFERROR(VLOOKUP(B59:B154,info!$E$7:$F$15,2,FALSE),\"\")","v":32.44},"aerification","none","drainage",0,null,0,0,null,"",0,0,0]
[null,null,{"$f":"IFERROR(VLOOKUP(B60:B155,info!$E$7:$F$15,2,FALSE),\"\")","v":""},{"$nulls":5}," ",null,null,"",null,null,0]
{"$rows_left_out":42}
{"sheet":"info","index":2,"n_rows":19,"n_cols":13,"rows_kept":19,"hidden":true}
[]
[]
[]
[]
[]
[{"$nulls":11},1.3,1.5]
[{"$nulls":4},"baseball",20.07,{"$nulls":5},1.4,1.2]
[{"$nulls":4},"softball",5.6,{"$nulls":5},1.3,1]
[{"$nulls":4},"baseball & softball",{"$f":"F7+F8","v":25.67},{"$nulls":5},2,1.32]
[{"$nulls":4},"football",17.41,{"$nulls":5},1,2]
[{"$nulls":4},"all competition",{"$f":"F9+F10","v":43.08},{"$nulls":5},1.23,1]
[{"$nulls":4},"hs practice",15.27,{"$nulls":5},1,1.8]
[{"$nulls":4},"ms practice",17.17,{"$nulls":5},1.34,1.1]
[{"$nulls":4},"all practice",{"$f":"F12+F13","v":32.44},{"$nulls":5},1.4,1]
[{"$nulls":11},1.54,1]
[{"$nulls":11},1.3,1.45]
[{"$nulls":11},1,1]
[{"$nulls":11},1,1.8]
[{"$nulls":11},1]

{"sheet":"totals","index":3,"n_rows":49,"n_cols":9,"rows_kept":49,"hidden":true,"merged":[[2,1,3,3],[4,0,4,4],[6,0,6,6],[19,0,19,4],[21,0,21,6],[30,0,30,4],[33,0,33,6],[34,0,34,1],[34,3,34,6],[35,0,35,1],[35,3,35,6],[36,0,36,1],[39,0,39,6],[43,0,43,3],[44,0,44,3],[46,0,46,6]]}
["Item ","Reason","Notes","Amount","Purchase Unit","Price/Unit","Totals"]
[]
["Comp Fields","See All Fields tab for details",{"$nulls":4},{"$f":"competition!O101","v":{"v":112299.5,"d":"$112,299.50"}}]
["Practice Fields",{"$nulls":5},{"$f":"practice!O101","v":{"v":58148,"d":"$58,148.00"}}]
["TOTAL",{"$nulls":5},{"$f":"G3+G4","v":{"v":170447.5,"d":"$170,447.50"}}]
[]
["ADDITIONAL PRODUCTS - TO BE PURCHASED AS NEEDED"]
["Celsius","Spot spray doveweed",null,80,"ounces",{"v":10,"d":"$10.00"},{"$f":"F8*D8","v":{"v":800,"d":"$800.00"}}]
["MSMA","Spot spray crabgrass",null,10,"gallons",{"v":25,"d":"$25.00"},{"$f":"F9*D9","v":{"v":250,"d":"$250.00"}}]
["RoundUp","Non-selective herbicide (infields)",null,20,"gallons",{"v":20,"d":"$20.00"},{"v":400,"d":"$400.00"}]
["Bifenthrin","Spot insecticide",null,5,"gallons",{"v":30,"d":"$30.00"},{"v":150,"d":"$150.00"}]
["Revolver","Alternate ryegrass spray out","87 oz jug*",10,"87 oz*",{"v":250,"d":"$250.00"},{"v":2500,"d":"$2,500.00"}]
["Subdue","Spot treat pythium on overseed",null,2.5,"gallons",{"v":375,"d":"$375.00"},{"v":937.5,"d":"$937.50"}]
["Image","Problem weeds in centipede",null,20,"pounds",{"v":145,"d":"$145.00"},{"v":2900,"d":"$2,900.00"}]
["Triclopyr","Woody plants ",null,20,"gallons",{"v":70,"d":"$70.00"},{"v":1400,"d":"$1,400.00"}]
["Top Choice","Fire Ants","30 lb. bag*",50,"30 lb bag*",{"v":60,"d":"$60.00"},{"v":3000,"d":"$3,000.00"}]
["Fahrenheit","Broad leaves","6 oz container*",78,"ounces",{"v":5,"d":"$5.00"},{"v":390,"d":"$390.00"}]
["Talpirid","Mole control","Box of 20 baits*",3,"boxes",{"v":50,"d":"$50.00"},{"v":150,"d":"$150.00"}]
["Trimec","Broad leaves",null,10,"gallons",{"v":25,"d":"$25.00"},{"v":250,"d":"$250.00"}]
["TOTAL",{"$nulls":5},{"$f":"SUM(G8:G19)","v":{"v":13127.5,"d":"$13,127.50"}}]
[]
["MISC."]
["Nitrile gloves","Safety",null,5,"box",{"v":20,"d":"$20.00"},{"$f":"F23*D23","v":{"v":100,"d":"$100.00"}}]
["Blue dye","Spray Indicator",null,4,"quarts",{"v":15,"d":"$15.00"},{"$f":"F24*D24","v":{"v":60,"d":"$60.00"}}]
["Foam marker","Spray Indicator",null,8,"quarts",{"v":20,"d":"$20.00"},{"v":160,"d":"$160.00"}]
["Foam suppressor","Tank additive",null,8,"quarts",{"v":10,"d":"$10.00"},{"v":80,"d":"$80.00"}]
["Tank Cleaner","Cleaner",null,8,"quarts",{"v":10,"d":"$10.00"},{"v":80,"d":"$80.00"}]
["Microyl","Adjuvant",null,10,"gallons",{"v":32,"d":"$32.00"},{"v":320,"d":"$320.00"}]
["Pen-A-Trate","Adjuvant",null,10,"gallons",{"v":30,"d":"$30.00"},{"v":300,"d":"$300.00"}]
["Speed","Adjuvant",null,10,"gallons",{"v":70,"d":"$70.00"},{"v":700,"d":"$700.00"}]
["TOTAL",{"$nulls":5},{"$f":"SUM(G23:G30)","v":{"v":1800,"d":"$1,800.00"}}]
[]
[]
["CULTURAL"]
["Aerification Sand",null,null,"included in field tabs"]
["Rye Grass Seed",null,null,"incuded in field tabs"]
["Sod Repairs",null,"square foot",25000,"sqft",{"v":0.4,"d":"$0.40"},{"$f":"F37*D37","v":{"v":10000,"d":"$10,000.00"}}]
[]
[]
["TESTING"]
["Soil Tests","Assess nutrient levels",null,25,null,null,{"v":1000,"d":"$1,000.00"}]
[]
[{"$nulls":8},{"$f":"157200+75000","v":{"v":232200,"d":"$232,200.00"}}]
["Total --->",{"$nulls":5},{"$f":"G5+G20+G31+G37+G41","v":{"v":196375,"d":"$196,375.00"}}]
["Cost per acre --->",{"$nulls":5},{"$f":"G44/45","v":{"v":4363.888888888889,"d":"$4,363.89"}},{"$f":"I43-G44","v":{"v":35825,"d":"$35,825.00"}}]
[]
["ADDITIONAL IF NECESSARY"]
["Lime per acre","Raise pH levels (1 acre)",null,"500 lbs/acre",null,null,{"v":60,"d":"$60.00"}]
["Gypsum per acre","Lower salt levels (1 acre)",null,"800 lbs/acre",null,null,{"v":133.6,"d":"$133.60"}]

{"sheet":"Fertilizers","index":4,"n_rows":11,"n_cols":7,"rows_kept":11,"merged":[[0,0,0,6]]}
["FERTILIZERS "]
["Name","Size/Type","Unit","Annual Est.","Can Supply as Requested","Can Supply Alternate","Alternate Description"]
["Uflexx Urea 46-0-0","fairway grade","50lb bag",12]
["Umaxx Urea 46-0-0","fairway grade","50lb bag",155]
["22-0-18 w/oxidiazon","fairway grade","50lb bag",{"$f":"220+165","v":385}]
["21-14-14 w/acelepryn (hot melt)","fairway grade","50lb bag",{"$f":"275+200","v":475}]
["21-0-0","fairway grade","50lb bag",{"$f":"165+165","v":330}]
["16-4-8","fairway grade","50lb bag",{"$f":"105+130","v":235}]
["12-0-0 liquid, w/6% Fe & 3% Mn","liquid","gallon",16]
["Cal Max G","fairway grade","50 lb bag",600]
["0-0-7 Ronstar","fairway grade","50lb bag",300]

{"sheet":"Pesticide, Chemicals","index":5,"n_rows":28,"n_cols":8,"rows_kept":28,"merged":[[0,0,0,7]]}
["PESTICIDES & CHEMICALS"]
["Type","Trade Name","Common Name","Unit","Annual Est.","Can Supply as Requested","Can Supply Alternate","Alternate Description"]
["Fungicide","Subdue","mefanoxam","gallon",2.5]
["Growth Regulator","Primo","trinexapac-ethyl","gallon",15]
["Herbicide","Celsius","thiencarbazone + iodosulfuron + dicamba","ounce",80]
["Herbicide","Certainty","sulfosulfuron","ounce",175]
["Herbicide","Fahrenheit","metsulfuron + dicamba","ounce",{"$f":"78+6","v":84}]
["Herbicide","Image","imazaquin","pound",20]
["Herbicide","MSMA","monosodium methylarsonate","gallon",75]
["Herbicide","Revolver","foramsulfuron","ounce",{"$f":"12*87","v":1044}]
["Herbicide","Round Up","glyphosate","gallon",20]
["Herbicide","Specticle","indaziflam","ounce",360]
["Herbicide","Tahoe","triclopyr","gallon",20]
["Herbicide","Trimec","2, 4-d + mecoprop + dicamba","gallon",45]
["Herbicide","Xonerate","amicarbazone","ounce",{"$f":"2*(7*12)","v":168}]
["Insecticide","Talpirid","bromethalin","20 bait box",3]
["Insecticide","Talstar","bifenthrin","gallon",5]
["Insecticide","Top Choice","fipronil","30 lb. bag",{"$f":"120+90+50","v":260}]
["Misc.","Blue dye","n/a","quart",4]
["Misc.","Foam marker","n/a","quart",8]
["Misc.","Foam suppressor","n/a","quart",8]
["Misc.","Tank Cleaner","n/a","quart",8]
["Misc.","Nitrile gloves","n/a","box",5]
["Spray Adjuvant","Microyl","n/a","gallon",10]
["Spray Adjuvant","Pen-A-Trate","n/a","gallon",10]
["Spray Adjuvant","Speed","n/a","gallon",10]
["Growth Regulator","Plateau","Imazapic","gallon",3]
["Herbicide","Kerb","Pronamide","Gallon",11]