{"text_format":"3","workbook":"xlsx","n_sheets":3,"sheets":["Sheet2","Sheet1","FOR BID"],"not_rendered":{"external_links":1,"pivot_tables":2},"read":"whole","date_system":"1900"}

{"sheet":"Sheet2","index":0,"n_rows":40,"n_cols":10,"rows_kept":40}
[]
[]
["Asset Type","Units",{"$nulls":3},"Row Labels","Count of Fet.Life Cycle"]
["Accessory-Attachment",19,{"$nulls":3},"Accessory-Attachment",19]
["Accessory-Electronics",1,{"$nulls":3},"Accessory-Electronics",1,null,null,606]
["Accessory-Hydraulics",1,{"$nulls":3},"Accessory-Hydraulics",1,null,null,38]
["Accessory-Lighting",1,{"$nulls":3},"Accessory-Lighting",1,null,null,{"$f":"J5-J6","v":568}]
["Accessory-Outboard Motor",13,{"$nulls":3},"Accessory-Outboard Motor",13]
["Accessory-Pump",3,{"$nulls":3},"Accessory-Pump",3]
["Boat",20,{"$nulls":3},"Grand Total",38]
["Equip Heavy-Backhoe-Loader",8]
["Equip Heavy-Bulldozer",3]
["Equip Heavy-Excavator",8]
["Equip Heavy-Grader",5]
["Equip Heavy-Roller",2]
["Equip Heavy-Sewer Jet-Vac",1]
["Equip Heavy-Tracked Construction",1]
["EV-Ambulance",12]
["EV-Fire Ladder",2]
["EV-Fire Pumper",19]
["Heavy Equipment",4]
["Heavy-Dump-Tandem",7]
["Heavy-Forklift",2]
["Heavy-Semi-Tractor",2]
["Heavy-Tractor-Mower",8]
["Heavy-Truck (7-8)",40]
["LE-Patrol",77]
["LE-Unmarked",62]
["Light-Pickup",80]
["Light-Sedan",5]
["Light-SUV",42]
["Light-Van Passenger",33]
["Medium-Truck Des 5-6",3]
["Mower",17]
["Towed-Construction Equip",14]
["Trailer",61]
["Trailer-Heavy",9]
["Trailer-Utility",2]
["UTV/ATV",19]
["Grand Total",606]
{"$rows_left_out":1}
{"sheet":"Sheet1","index":1,"n_rows":607,"n_cols":24,"rows_kept":607}
["Fet.VIN / Serial Number","ID","Fet.Department Code","Fet.Department","Fet.Life Cycle","Fet.Type","Fet.Model Year","Fet.Manufacturer","Fet.Model","Fet.Trim","Fet.License Plate","FVS lifemeter","BeehiveLife","Mileage/Hours","Notes","Fet.Disposal Date","Fet.Fiscal Year Disposed","Fet.Fiscal Year Acquired","Purchase Date","Fet.Insurance Carrier","Fet.Insurance Number","Fet.Acquisition PO Value","Column1","Fet.Confidence  Data"]
["1P06120EPG0001862","6091862  2017 John Deere ","609","Airport Commission ","Active","HeavyTractorMower","2017","John Deere",null,"6120E",null,390,{"$f":"VLOOKUP(Table1[[#This Row],[Fet.VIN / Serial Number]],[1]Sheet1!$A$1:$D$642, 4,FALSE)","v":390},390,{"$nulls":3},2018,{"$nulls":3},101382.5]
["101926808","6096808  2011 Husqvarna PZ5426 Zero Turn Mower","609","Airport Commission ","Active","Mower","2011","Husqvarna","PZ5426 Zero Turn Mower",{"$nulls":3},{"$f":"VLOOKUP(Table1[[#This Row],[Fet.VIN / Serial Number]],[1]Sheet1!$A$1:$D$642, 4,FALSE)","v":{"v":1030,"d":"1,030"}},{"v":1030,"d":"1,030"},{"$nulls":4},"2011-07-27","Inland Marine M130220021","2910"]
["1P0HX15FEHT079136","6099136  2017 John Deere HX15 Brush Cutter","609","Airport Commission ","Active","Mower","2017","John Deere","HX15 Brush Cutter",null,null,0,{"$f":"VLOOKUP(Table1[[#This Row],[Fet.VIN / Serial Number]],[1]Sheet1!$A$1:$D$642, 4,FALSE)","v":0},0,{"$nulls":9},""]
["5HABE10117N002527","2527  2007 HMSTD Trailer","214","Alternate EOC","Active","Trailer","2007","Homesteader","Trailer","610CS","","",{"$f":"VLOOKUP(Table1[[#This Row],[Fet.VIN / Serial Number]],[1]Sheet1!$A$1:$D$642, 4,FALSE)","v":0},"","",{"$nulls":3},"2008-12-12",null,"2140"]
["5HABE10117N002530","2530  2007 HMSTD Trailer","214","Alternate EOC","Active","Trailer","2007","Homesteader","Trailer","610CS","","",{"$f":"VLOOKUP(Table1[[#This Row],[Fet.VIN / Serial Number]],[1]Sheet1!$A$1:$D$642, 4,FALSE)","v":0},"","",{"$nulls":3},"2008-12-12",null,"2150"]
["1FTFX1EF0DKD65961","2055961  2013 FORD F150","205","Animal Control","Active","LightPickup","2013","Ford","","MARKED","CG69735",{"v":235736,"d":"235,736"},{"$f":"VLOOKUP(Table1[[#This Row],[Fet.VIN / Serial Number]],[1]Sheet1!$A$1:$D$642, 4,FALSE)","v":{"v":1497,"d":"1,497"}},{"v":235736,"d":"235,736"},"",null,null,2013,"2013-01-31",null,null,28825,null,"1"]
["1FTFX1EF2FKD91593","2051593  2015 FORD F150","205","Animal Control","Active","LightPickup","2015","Ford","","MARKED animal control","CG74050",{"v":145655,"d":"145,655"},{"$f":"VLOOKUP(Table1[[#This Row],[Fet.VIN / Serial Number]],[1]Sheet1!$A$1:$D$642, 4,FALSE)","v":0},{"v":145655,"d":"145,655"},"",null,null,2015,"2015-08-12","Comp Collision","11160",35439,null,"1"]
["5N1AT3AB2MC697135","1277135  2021 Nissan Rogue","127","Assessor","Active","LightSUV","2021","Nissan","Rogue",null,"CG84357",270,{"$f":"VLOOKUP(Table1[[#This Row],[Fet.VIN / Serial Number]],[1]Sheet1!$A$1:$D$642, 4,FALSE)","v":270},270,{"$nulls":5},"Comp Collision","13610",null,null,""]
["5N1AT3AB9MC709202","1279202  2021 Nissan Rogue","127","Assessor","Active","LightSUV","2021","Nissan","Rogue",null,"CG84358",{"v":1403,"d":"1,403"},{"$f":"VLOOKUP(Table1[[#This Row],[Fet.VIN / Serial Number]],[1]Sheet1!$A$1:$D$642, 4,FALSE)","v":{"v":1403,"d":"1,403"}},{"v":1403,"d":"1,403"},{"$nulls":5},"Comp Collision","13600",null,null,""]
["1FMCU93128KD64782","1514782  2008 Ford Escape","151","Assessor","Active","LightSUV","2008","Ford","Escape",null,"CG62148",{"v":64727,"d":"64,727"},{"$f":"VLOOKUP(Table1[[#This Row],[Fet.VIN / Serial Number]],[1]Sheet1!$A$1:$D$642, 4,FALSE)","v":{"v":2450,"d":"2,450"}},{"v":64727,"d":"64,727"},"Listed as 010.103 Pool in Fuelman",null,null,2008,"2008-03-27","Comp Collision","7490",17971]
["1FMCU0F77JUA25456","1335456  2018 Ford Escape","133","Building Department","Active","LightSUV","2018","Ford","Escape","","CG78004",{"v":76788,"d":"76,788"},{"$f":"VLOOKUP(Table1[[#This Row],[Fet.VIN / Serial Number]],[1]Sheet1!$A$1:$D$642, 4,FALSE)","v":{"v":75889,"d":"75,889"}},{"v":76788,"d":"76,788"},"the possible fuel card match for this unit says Public work with a different plate.  \n\n",null,null,2018,"2017-11-01","Comp Collision","12340",19728]
["1FMCU0F75JUA25455","1335455  2018 Ford Escape","133","Building Department","Active","LightSUV","2018","Ford","Escape","S 4x2","CG78005",{"v":72454,"d":"72,454"},{"$f":"VLOOKUP(Table1[[#This Row],[Fet.VIN / Serial Number]],[1]Sheet1!$A$1:$D$642, 4,FALSE)","v":0},{"v":72454,"d":"72,454"},{"$nulls":3},2018,"2017-11-01","Comp Collision","12330",19728]
["1FTFX1E59MKD26745","1336745  2021 Ford F150","133","Building Department","Active","LightPickup","2021","Ford","F150",null,"CG84355",{"v":17985,"d":"17,985"},{"$f":"VLOOKUP(Table1[[#This Row],[Fet.VIN / Serial Number]],[1]Sheet1!$A$1:$D$642, 4,FALSE)","v":0},{"v":17985,"d":"17,985"},{"$nulls":5},"Comp Collision","13670",null,null,""]
["1FMCU0F79HUC12434","1332434  2017 Ford Escape","133","Building Department","Active","LightSUV","2017","Ford","Escape","","CG76322",{"v":74680,"d":"74,680"},{"$f":"VLOOKUP(Table1[[#This Row],[Fet.VIN / Serial Number]],[1]Sheet1!$A$1:$D$642, 4,FALSE)","v":{"v":36663,"d":"36,663"}},{"v":74680,"d":"74,680"},"",null,null,2017,"2017-01-03","Comp Collision","11940",20212]
["1FM5K7B82HGB22997","2112997  2017 Ford Explorer","211","Coroner","Active","LightSUV","2017","Ford","Explorer",null,"NFI225",{"v":54269,"d":"54,269"},{"$f":"VLOOKUP(Table1[[#This Row],[Fet.VIN / Serial Number]],[1]Sheet1!$A$1:$D$642, 4,FALSE)","v":{"v":53721,"d":"53,721"}},{"v":54269,"d":"54,269"},{"$nulls":3},2017,"2017-04-13","Comp Collision","12310",25555]
["5N1AT3AA7MC692858","1112858  2021 Nissan Rogue","111","Courts","Active","LightSUV","2021","Nissan","Rogue",null,"CG84301",{"v":5114,"d":"5,114"},{"$f":"VLOOKUP(Table1[[#This Row],[Fet.VIN / Serial Number]],[1]Sheet1!$A$1:$D$642, 4,FALSE)","v":0},{"v":5114,"d":"5,114"},"",{"$nulls":4},"Comp Collision","13590",null,null,""]
["2FABP7BV7BX111029","2071029  2011 FORD Crown Victoria","207","Detention Center","Active","LEPatrol","2011","Ford","Crown Victoria","","CG66841",{"v":144410,"d":"144,410"},{"$f":"VLOOKUP(Table1[[#This Row],[Fet.VIN / Serial Number]],[1]Sheet1!$A$1:$D$642, 4,FALSE)","v":{"v":139063,"d":"139,063"}},{"v":144410,"d":"144,410"},"",{"$nulls":3},"2010-12-27","Comp Collision","8500",null,null,"1"]
["110116B003540","2073540  2018 Husqvarna MZ61 Zero Turn Mower","207","Detention Center","Active","Mower","2018","Husqvarna","MZ61 Zero Turn Mower",null,null,398,{"$f":"VLOOKUP(Table1[[#This Row],[Fet.VIN / Serial Number]],[1]Sheet1!$A$1:$D$642, 4,FALSE)","v":40},398,{"$nulls":9},""]
["1FMEU63E48UA83775","2072073775  2008 FORD EXPLORER","207","Detention Center","Active","LEUnmarked","2008","Ford","Explorer","GOLD","DVZ891",{"v":137158,"d":"137,158"},{"$f":"VLOOKUP(Table1[[#This Row],[Fet.VIN / Serial Number]],[1]Sheet1!$A$1:$D$642, 4,FALSE)","v":{"v":138427,"d":"138,427"}},{"v":138427,"d":"138,427"},"",null,null,2008,"2008-04-24","Comp Collision","11150",21712,null,"1"]
["1GCZGHFG9K1364503","2074503  2019 Chevrolet Express","207","Detention Center","Active","LightVan Passenger","2019","Chevrolet","Express","Van","CG81681",{"v":1722,"d":"1,722"},{"$f":"VLOOKUP(Table1[[#This Row],[Fet.VIN / Serial Number]],[1]Sheet1!$A$1:$D$642, 4,FALSE)","v":5},{"v":1722,"d":"1,722"},"CERP",null,null,2019,"2019-09-15","Comp Collision","13030",28583]
["3042727","2072727  2014 EZGO Golf Cart","207","Detention Center","Active","UTV/ATV","2014","EZGO","Golf Cart",null,null,30,{"$f":"VLOOKUP(Table1[[#This Row],[Fet.VIN / Serial Number]],[1]Sheet1!$A$1:$D$642, 4,FALSE)","v":0},30,{"$nulls":9},""]
["1FMJU1G55CEF47767","2072077767  2012 FORD EXPEDITION","207","Detention Center","Active","LEPatrol","2012","Ford","Expedition","BLACK","IBG696",{"v":75126,"d":"75,126"},{"$f":"VLOOKUP(Table1[[#This Row],[Fet.VIN / Serial Number]],[1]Sheet1!$A$1:$D$642, 4,FALSE)","v":{"v":76690,"d":"76,690"}},{"v":76690,"d":"76,690"},"",null,null,2012,"2012-06-05","Comp Collision","8850",32660,null,"1"]
["1C4RDJAG6MC575205","2075205  2021 DODGE DURANGO","207","Detention Center","Active","LEUnmarked","2021","Dodge","Durango","WHITE","TUP638",{"v":12142,"d":"12,142"},{"$f":"VLOOKUP(Table1[[#This Row],[Fet.VIN / Serial Number]],[1]Sheet1!$A$1:$D$642, 4,FALSE)","v":{"v":8202,"d":"8,202"}},{"v":12142,"d":"12,142"},"",{"$nulls":8},"1"]
["1FBSS31L46DA76923","2076923  2006 Ford Econoline ","207","Detention Center","Active","LightVan Passenger","2006","Ford","Econoline ","Club Wagon","CG61257",{"v":73998,"d":"73,998"},{"$f":"VLOOKUP(Table1[[#This Row],[Fet.VIN / Serial Number]],[1]Sheet1!$A$1:$D$642, 4,FALSE)","v":{"v":73998,"d":"73,998"}},{"v":73998,"d":"73,998"},{"$nulls":3},2006,"2007-04-30","Comp Collision","6480",20575]
["5BFAU1822CM018935","2078935  2012 Leonard Leonard B12 Trash Trailer","207","Detention Center","Active","Trailer","2012","Leonard","Leonard B12 Trash Trailer","Litter Patrol","",0,{"$f":"VLOOKUP(Table1[[#This Row],[Fet.VIN / Serial Number]],[1]Sheet1!$A$1:$D$642, 4,FALSE)","v":0},0,"",{"$nulls":3},"2013-04-22","Inland Marine M130220021","3730"]
["2C4RDGBG3DR628824","2078824  2013 DODGE Grand Caravan","207","Detention Center","Active","LightVan Passenger","2013","Dodge","Caravan",null,"CG69736",null,{"$f":"VLOOKUP(Table1[[#This Row],[Fet.VIN / Serial Number]],[1]Sheet1!$A$1:$D$642, 4,FALSE)","v":{"v":57138,"d":"57,138"}},{"v":57138,"d":"57,138"},"2C4RDGBG3DR628824  Correct\n2C4RDGB3DR628824   INCORRECT\n\n",null,null,2013,"2014-02-06","Comp Collision","9400",21487,null,"1"]
["1FM5K7B80FGB83780","2072073780  2015 FORD EXPLORER","207","Detention Center","Active","LEUnmarked","2015","Ford","Explorer","BLACK","KYY407",{"v":76844,"d":"76,844"},{"$f":"VLOOKUP(Table1[[#This Row],[Fet.VIN / Serial Number]],[1]Sheet1!$A$1:$D$642, 4,FALSE)","v":{"v":76842,"d":"76,842"}},{"v":76844,"d":"76,844"},"",null,null,2015,"2015-03-11","Comp Collision","11760",24861,null,"1"]
["2C4RDGBG6DR765630","2072075630  2013 DODGE CARAVAN","207","Detention Center","Active","LightVan Passenger","2013","Dodge","Caravan","WHITE","JIM523",{"v":85546,"d":"85,546"},{"$f":"VLOOKUP(Table1[[#This Row],[Fet.VIN / Serial Number]],[1]Sheet1!$A$1:$D$642, 4,FALSE)","v":{"v":85036,"d":"85,036"}},{"v":85546,"d":"85,546"},"this vin missing didgit",null,null,2013,"2013-07-22","Comp Collision","9540",28031,null,"1"]
["1FBSS3BL9ADA88007","2072078007  2010 FORD EXPLORER","207","Detention Center","Active","LightVan Passenger","2010","Ford","Explorer","Club Wagon","CG66243",{"v":74978,"d":"74,978"},{"$f":"VLOOKUP(Table1[[#This Row],[Fet.VIN / Serial Number]],[1]Sheet1!$A$1:$D$642, 4,FALSE)","v":{"v":74908,"d":"74,908"}},{"v":74978,"d":"74,978"},"",null,null,2010,"2010-10-21","Comp Collision","8470",35616,null,"1"]
["2G1WD5EM1B1206810","2056810  2011 Chevrolet IMPALA","205","Detention Center","Active","LEUnmarked","2011","Chevrolet","Impala","BLACK","QYL245",{"v":159339,"d":"159,339"},{"$f":"VLOOKUP(Table1[[#This Row],[Fet.VIN / Serial Number]],[1]Sheet1!$A$1:$D$642, 4,FALSE)","v":0},{"v":159339,"d":"159,339"},"Maybe belongs to DEPT 121 Summary Court ?\n\nTag GZJ707 expire  3/2015\n\nNew tag?  \n",{"$nulls":3},"2011-06-23","Comp Collision","11230",null,null,"1"]
["1FDUF4GT0HEC16545","4116545  2017 Ford F450","411","Emergency Medical Service","Active","EVAmbulance","2017","Ford","F450","Ambulance","CG77210",{"v":118183,"d":"118,183"},{"$f":"VLOOKUP(Table1[[#This Row],[Fet.VIN / Serial Number]],[1]Sheet1!$A$1:$D$642, 4,FALSE)","v":0},{"v":118183,"d":"118,183"},"",null,null,2017,"2017-06-15","Comp Collision","12090",106750]
["1HTJSSKK8FH729708","4119708  2015 International Terra Star","411","Emergency Medical Service","Active","EVAmbulance","2015","International","Terra Star","Ambulance","CG74048",{"v":200786,"d":"200,786"},{"$f":"VLOOKUP(Table1[[#This Row],[Fet.VIN / Serial Number]],[1]Sheet1!$A$1:$D$642, 4,FALSE)","v":0},{"v":200786,"d":"200,786"},{"$nulls":3},2015,"2015-06-02","Comp Collision","11090",185025]
["3C7WRKCJXHG643417","4113417  2017 Dodge 4500","411","Emergency Medical Service","Active","EVAmbulance","2017","Dodge","4500","Ambulance","CG77212",{"v":198833,"d":"198,833"},{"$f":"VLOOKUP(Table1[[#This Row],[Fet.VIN / Serial Number]],[1]Sheet1!$A$1:$D$642, 4,FALSE)","v":0},{"v":198833,"d":"198,833"},"",null,null,2017,"2017-06-15","Comp Collision","12100",191400]
["1HTJSSKK5EH797799","4117799  2014 International Terra Star","411","Emergency Medical Service","Active","EVAmbulance","2014","International","Terra Star","Ambulance","CG72301",{"v":180341,"d":"180,341"},{"$f":"VLOOKUP(Table1[[#This Row],[Fet.VIN / Serial Number]],[1]Sheet1!$A$1:$D$642, 4,FALSE)","v":{"v":179909,"d":"179,909"}},{"v":180341,"d":"180,341"},"",null,null,2014,"2013-12-31","Comp Collision","11730",178075]
["1HTJSSKKXHH452434","4112434  2017 International Terra Star","411","Emergency Medical Service","Active","EVAmbulance","2017","International","Terra Star","Ambulance","CG74160",{"v":166141,"d":"166,141"},{"$f":"VLOOKUP(Table1[[#This Row],[Fet.VIN / Serial Number]],[1]Sheet1!$A$1:$D$642, 4,FALSE)","v":{"v":161229,"d":"161,229"}},{"v":166141,"d":"166,141"},"",null,null,2016,"2016-06-01","Comp Collision","11380",187550]
["3C7WRKCJ1JG233854","4113854  2018 Dodge 4500","411","Emergency Medical Service","Active","EVAmbulance","2018","Dodge","4500","Ambulance","CG78638",{"v":114558,"d":"114,558"},{"$f":"VLOOKUP(Table1[[#This Row],[Fet.VIN / Serial Number]],[1]Sheet1!$A$1:$D$642, 4,FALSE)","v":{"v":115970,"d":"115,970"}},{"v":115970,"d":"115,970"},{"$nulls":3},2018,"2018-03-25","Comp Collision","12500",105664]
["FB710003","2130003  2008 Ruddy Flatbed Trailer","213","Emergency Preparedness","Active","Trailer","2008","Ruddy","Flatbed Trailer",null,"",384,{"$f":"VLOOKUP(Table1[[#This Row],[Fet.VIN / Serial Number]],[1]Sheet1!$A$1:$D$642, 4,FALSE)","v":384},384,"Can't find on INS inland marine",null,null,2007,"2011-05-05",null,null,2475]
["74720","2134720  2018  Trailer","213","Emergency Preparedness","Active","Trailer","2018","","Trailer","Morgue Trailer",null,0,{"$f":"VLOOKUP(Table1[[#This Row],[Fet.VIN / Serial Number]],[1]Sheet1!$A$1:$D$642, 4,FALSE)","v":0},0,"Morgue Trailer",{"$nulls":4},"Inland Marine M130220021","4650",null,null,""]
["4DGEB2829GA037272","2137272  2016 Cargo Craft Trailer","213","Emergency Preparedness","Active","Trailer","2016","Cargo Craft","Trailer",null,null,0,{"$f":"VLOOKUP(Table1[[#This Row],[Fet.VIN / Serial Number]],[1]Sheet1!$A$1:$D$642, 4,FALSE)","v":0},0,{"$nulls":5},"Inland Marine M130220021","4080",null,null,""]
{"$rows_left_out":568}
{"sheet":"FOR BID","index":2,"n_rows":609,"n_cols":11,"rows_kept":609,"merged":[[0,0,0,10]]}
["ATTACHMENT B:  VEHICLE AND EQUIPMENT LIST"]
[]
["Fet.VIN / Serial Number","ID","Fet. Depart. Code","Fet.Department","Fet.Type","Fet. Model Year","Fet.Manufacturer","Fet.Model","Fet.Trim","Fet. License Plate","Mileage/ Hours"]
["1P06120EPG0001862","6091862  2017 John Deere ","609","Airport Commission ","HeavyTractorMower","2017","John Deere",null,"6120E",null,390]
["101926808","6096808  2011 Husqvarna PZ5426 Zero Turn Mower","609","Airport Commission ","Mower","2011","Husqvarna","PZ5426 Zero Turn Mower",null,null,{"v":1030,"d":"1,030"}]
["1P0HX15FEHT079136","6099136  2017 John Deere HX15 Brush Cutter","609","Airport Commission ","Mower","2017","John Deere","HX15 Brush Cutter",null,null,0]
["5HABE10117N002527","2527  2007 HMSTD Trailer","214","Alternate EOC","Trailer","2007","Homesteader","Trailer","610CS","",""]
["5HABE10117N002530","2530  2007 HMSTD Trailer","214","Alternate EOC","Trailer","2007","Homesteader","Trailer","610CS","",""]
["1FTFX1EF0DKD65961","2055961  2013 FORD F150","205","Animal Control","LightPickup","2013","Ford","","MARKED","CG69735",{"v":235736,"d":"235,736"}]
["1FTFX1EF2FKD91593","2051593  2015 FORD F150","205","Animal Control","LightPickup","2015","Ford","","MARKED animal control","CG74050",{"v":145655,"d":"145,655"}]
["5N1AT3AB2MC697135","1277135  2021 Nissan Rogue","127","Assessor","LightSUV","2021","Nissan","Rogue",null,"CG84357",270]
["5N1AT3AB9MC709202","1279202  2021 Nissan Rogue","127","Assessor","LightSUV","2021","Nissan","Rogue",null,"CG84358",{"v":1403,"d":"1,403"}]
["1FMCU93128KD64782","1514782  2008 Ford Escape","151","Assessor","LightSUV","2008","Ford","Escape",null,"CG62148",{"v":64727,"d":"64,727"}]
["1FMCU0F77JUA25456","1335456  2018 Ford Escape","133","Building Department","LightSUV","2018","Ford","Escape","","CG78004",{"v":76788,"d":"76,788"}]
["1FMCU0F75JUA25455","1335455  2018 Ford Escape","133","Building Department","LightSUV","2018","Ford","Escape","S 4x2","CG78005",{"v":72454,"d":"72,454"}]
["1FTFX1E59MKD26745","1336745  2021 Ford F150","133","Building Department","LightPickup","2021","Ford","F150",null,"CG84355",{"v":17985,"d":"17,985"}]
["1FMCU0F79HUC12434","1332434  2017 Ford Escape","133","Building Department","LightSUV","2017","Ford","Escape","","CG76322",{"v":74680,"d":"74,680"}]
["1FM5K7B82HGB22997","2112997  2017 Ford Explorer","211","Coroner","LightSUV","2017","Ford","Explorer",null,"NFI225",{"v":54269,"d":"54,269"}]
["5N1AT3AA7MC692858","1112858  2021 Nissan Rogue","111","Courts","LightSUV","2021","Nissan","Rogue",null,"CG84301",{"v":5114,"d":"5,114"}]
["2FABP7BV7BX111029","2071029  2011 FORD Crown Victoria","207","Detention Center","LEPatrol","2011","Ford","Crown Victoria","","CG66841",{"v":144410,"d":"144,410"}]
["110116B003540","2073540  2018 Husqvarna MZ61 Zero Turn Mower","207","Detention Center","Mower","2018","Husqvarna","MZ61 Zero Turn Mower",null,null,398]
["1FMEU63E48UA83775","2072073775  2008 FORD EXPLORER","207","Detention Center","LEUnmarked","2008","Ford","Explorer","GOLD","DVZ891",{"v":138427,"d":"138,427"}]
["1GCZGHFG9K1364503","2074503  2019 Chevrolet Express","207","Detention Center","LightVan Passenger","2019","Chevrolet","Express","Van","CG81681",{"v":1722,"d":"1,722"}]
["3042727","2072727  2014 EZGO Golf Cart","207","Detention Center","UTV/ATV","2014","EZGO","Golf Cart",null,null,30]
["1FMJU1G55CEF47767","2072077767  2012 FORD EXPEDITION","207","Detention Center","LEPatrol","2012","Ford","Expedition","BLACK","IBG696",{"v":76690,"d":"76,690"}]
["1C4RDJAG6MC575205","2075205  2021 DODGE DURANGO","207","Detention Center","LEUnmarked","2021","Dodge","Durango","WHITE","TUP638",{"v":12142,"d":"12,142"}]
["1FBSS31L46DA76923","2076923  2006 Ford Econoline ","207","Detention Center","LightVan Passenger","2006","Ford","Econoline ","Club Wagon","CG61257",{"v":73998,"d":"73,998"}]
["5BFAU1822CM018935","2078935  2012 Leonard Leonard B12 Trash Trailer","207","Detention Center","Trailer","2012","Leonard","Leonard B12 Trash Trailer","Litter Patrol","",0]
["2C4RDGBG3DR628824","2078824  2013 DODGE Grand Caravan","207","Detention Center","LightVan Passenger","2013","Dodge","Caravan",null,"CG69736",{"v":57138,"d":"57,138"}]
["1FM5K7B80FGB83780","2072073780  2015 FORD EXPLORER","207","Detention Center","LEUnmarked","2015","Ford","Explorer","BLACK","KYY407",{"v":76844,"d":"76,844"}]
["2C4RDGBG6DR765630","2072075630  2013 DODGE CARAVAN","207","Detention Center","LightVan Passenger","2013","Dodge","Caravan","WHITE","JIM523",{"v":85546,"d":"85,546"}]
["1FBSS3BL9ADA88007","2072078007  2010 FORD EXPLORER","207","Detention Center","LightVan Passenger","2010","Ford","Explorer","Club Wagon","CG66243",{"v":74978,"d":"74,978"}]
["2G1WD5EM1B1206810","2056810  2011 Chevrolet IMPALA","205","Detention Center","LEUnmarked","2011","Chevrolet","Impala","BLACK","QYL245",{"v":159339,"d":"159,339"}]
["1FDUF4GT0HEC16545","4116545  2017 Ford F450","411","Emergency Medical Service","EVAmbulance","2017","Ford","F450","Ambulance","CG77210",{"v":118183,"d":"118,183"}]
["1HTJSSKK8FH729708","4119708  2015 International Terra Star","411","Emergency Medical Service","EVAmbulance","2015","International","Terra Star","Ambulance","CG74048",{"v":200786,"d":"200,786"}]
["3C7WRKCJXHG643417","4113417  2017 Dodge 4500","411","Emergency Medical Service","EVAmbulance","2017","Dodge","4500","Ambulance","CG77212",{"v":198833,"d":"198,833"}]
["1HTJSSKK5EH797799","4117799  2014 International Terra Star","411","Emergency Medical Service","EVAmbulance","2014","International","Terra Star","Ambulance","CG72301",{"v":180341,"d":"180,341"}]
["1HTJSSKKXHH452434","4112434  2017 International Terra Star","411","Emergency Medical Service","EVAmbulance","2017","International","Terra Star","Ambulance","CG74160",{"v":166141,"d":"166,141"}]
["3C7WRKCJ1JG233854","4113854  2018 Dodge 4500","411","Emergency Medical Service","EVAmbulance","2018","Dodge","4500","Ambulance","CG78638",{"v":115970,"d":"115,970"}]
["FB710003","2130003  2008 Ruddy Flatbed Trailer","213","Emergency Preparedness","Trailer","2008","Ruddy","Flatbed Trailer",null,"",384]
{"$rows_left_out":569}