{"text_format":"3","workbook":"xlsx","n_sheets":13,"sheets":["What is the K-12CVAT","Introduction","Instructions","K-12CVAT","Standards Crosswalk","Analyst Report","Analyst Reference","Summary Report","Crosswalk Detail","High Risk Non-Compliant","Questions","Values","ChangeLog"],"not_rendered":{"charts":1,"images":3,"defined_names":6,"comments":1,"pivot_tables":1},"read":"whole","date_system":"1900"}

{"sheet":"What is the K-12CVAT","index":0,"n_rows":55,"n_cols":1,"rows_kept":55,"merged":[[0,0,0,1],[54,0,54,1]]}
{"$rows_empty":54}
["Proceed to the next tab, Introduction."]

{"sheet":"Introduction","index":1,"n_rows":55,"n_cols":1,"rows_kept":55,"merged":[[0,0,0,1],[54,0,54,1]]}
{"$rows_empty":54}
["Proceed to the next tab, Instructions."]

{"sheet":"Instructions","index":2,"n_rows":24,"n_cols":2,"rows_kept":24,"merged":[[0,0,0,1],[1,0,1,1],[2,0,2,1],[3,0,3,1],[4,0,4,1],[5,0,5,1],[10,0,10,1],[11,0,11,1],[12,0,12,1],[16,0,16,1],[18,0,18,1],[19,0,19,1],[20,0,20,1],[21,0,21,1],[22,0,22,1],[23,0,23,1]]}
["K-12 Vendor Assessment Tool - Lite - Instructions"]
[]
["Target Audience"]
["These instructions are for vendors interested in providing the school system with a software and/or a service. \nThis worksheet should not be completed by the K-12 school system entity. The purpose of this worksheet is for the vendor to submit robust security safeguard information in regards to the product (software/service) being assessed in the Institution's assessment process."]
["Document Layout"]
["There are four main sections of the K-12 Community Vendor Assessment Tool - Lite, all listed below and outlined in more detail. Within each section, answer each question top-to-bottom. Some questions are nested and may be blocked out via formatting based on previous answers. Populating this document in the correct order improves efficiency.                                                            \nDo not overwrite selection values (data validation) in column C of the K-12CVAT - Lite tab."]
["General Information","This section is self-explanatory; product specifics and contact information. GNRL-01 through GNRL-10 should be populated by the Vendor. GNRL-11 and GNRL-12 are for K-12 School System/Institution use only."]
["Documentation","Focused on external documentation, the Institution is interested in the frameworks that guide your security strategy and what has been done to certify these implementations."]
["Company Overview","This section is focused on company background, size, and business area experience."]
["Safeguards","The remainder of the document consists of various safeguards, grouped generally by section."]
{"$rows_left_out":15}
{"sheet":"K-12CVAT","index":3,"n_rows":99,"n_cols":7,"rows_kept":99,"merged":[[0,0,0,3],[1,0,1,4],[2,2,2,4],[3,0,3,4],[4,0,4,4],[5,0,5,4],[6,2,6,4],[7,2,7,4],[8,2,8,4],[9,2,9,4],[10,2,10,4],[11,2,11,4],[12,2,12,4],[13,2,13,4],[14,2,14,4],[15,2,15,4],[16,0,16,4],[17,2,17,4],[18,2,18,4],[19,0,19,4],[20,0,20,4],[21,0,21,1],[28,0,28,1],[29,2,29,3],[30,2,30,3],[37,2,37,3],[38,0,38,1],[47,0,47,1],[52,0,52,1],[57,0,57,1],[61,0,61,1],[68,0,68,1],[70,0,70,1],[74,0,74,1],[78,0,78,1],[83,0,83,1],[86,0,86,1],[91,0,91,1],[95,0,95,1]]}
["K-12 Community Vendor Assessment Tool (CVAT) - Lite",{"$nulls":3},"Version 3.0"]
[]
["DATE-01","Date","mm/dd/yyyy"]
["General Information"]
["In order to protect the institution (school, district or service district) and its systems, vendors whose products and/or services will access and/or host institutional data must complete the K-12 Community Vendor Assessment Toolkit. Throughout this tool, anywhere where the term data is used, this is an all-encompassing term including at least data and metadata. Answers will be reviewed by institution security analysts upon submittal. This process will assist the institution in preventing breaches of protected information and comply with institution policy, state, and federal law. This is intended for use by vendors and should be completed by the vendor."]
["GNRL-01 through GNRL-15; populated by Vendor"]
["GNRL-01","Vendor Name","Vendor Name"]
["GNRL-02","Product Name","Product Name and Version Information"]
["GNRL-03","Product Description","Brief Description of the Product"]
["GNRL-04","Web Link to Product Privacy Notice","http://www.vendor.domain/privacynotice"]
{"$rows_left_out":90}
{"sheet":"Standards Crosswalk","index":4,"n_rows":104,"n_cols":9,"rows_kept":104,"merged":[[0,0,0,7],[1,0,1,7],[21,0,21,1],[28,0,28,1],[38,0,38,1],[45,0,45,1],[50,0,50,1],[55,0,55,1],[59,0,59,1],[66,0,66,1],[68,0,68,1],[72,0,72,1],[76,0,76,1],[81,0,81,1],[84,0,84,1],[89,0,89,1],[93,0,93,1]]}
["K-12 Community Vendor Assessment Tool (K-12CVAT)  - Standards Crosswalk"]
{"$rows_empty":20}
["Documentation",null,"CIS Critical Security Controls v6.1","HIPAA","ISO 27002:2013","NIST Cybersecurity Framework","NIST SP 800-171r1","NIST SP 800-53r4"]
["DOCU-01",{"$f":"VLOOKUP(A23,'K-12CVAT'!A$23:B$99,2,FALSE)","v":"Have you undergone a SSAE 18 audit?"},null,null,"15.2.1",null,null,"SA-9"]
["DOCU-02",{"$f":"VLOOKUP(A24,'K-12CVAT'!A$23:B$99,2,FALSE)","v":"Have you completed the Cloud Security Alliance (CSA) self assessment or CAIQ?"},null,null,"15.2.1",null,null,"PE-2, PE-3, PE-5, PE-11, PE-13, PE-14, SA-9"]
["DOCU-03",{"$f":"VLOOKUP(A25,'K-12CVAT'!A$23:B$99,2,FALSE)","v":"Have you received the Cloud Security Alliance STAR certification?"},null,null,"15.2.1",null,null,"PE-2, PE-3, PE-5, PE-11, PE-13, PE-14, SA-9"]
["DOCU-04",{"$f":"VLOOKUP(A26,'K-12CVAT'!A$23:B$99,2,FALSE)","v":"Do you conform with a specific industry standard security framework? (e.g. NIST Cybersecurity Framework, ISO 27001, etc.) Please identify which one under \"additional information\""},null,null,"18.1.1",null,null,"SA-9"]
["DOCU-05",{"$f":"VLOOKUP(A27,'K-12CVAT'!A$23:B$99,2,FALSE)","v":"Are you compliant with FISMA standards?"},null,null,"18.1.1",null,null,"SA-9"]
["DOCU-06",{"$f":"VLOOKUP(A28,'K-12CVAT'!A$23:B$99,2,FALSE)","v":"Would you sign the Student Data Privacy Consortium statement for the state in which our district is located? (https://sdpc.a4l.org/) "},null,"§164.308(a)(1)(i)","18.1.4","ID.GV-3","ID.GV-3","SA-9"]
["Company Overview",null,{"$f":"$C$22","v":"CIS Critical Security Controls v6.1"},{"$f":"$D$22","v":"HIPAA"},{"$f":"$E$22","v":"ISO 27002:2013"},{"$f":"$F$22","v":"NIST Cybersecurity Framework"},{"$f":"$G$22","v":"NIST SP 800-171r1"},{"$f":"$H$22","v":"NIST SP 800-53r4"}]
{"$rows_left_out":76}
{"sheet":"Analyst Report","index":5,"n_rows":53,"n_cols":9,"rows_kept":53,"merged":[[0,0,0,6],[1,0,1,7],[2,0,2,7],[3,0,3,7],[4,1,4,2],[4,5,4,7],[5,1,5,2],[5,5,5,7],[6,1,6,2],[6,5,6,7],[7,1,7,2],[7,5,7,7],[9,3,9,7],[29,0,29,5],[29,6,29,7],[30,1,30,2],[30,3,30,5],[30,6,30,7],[31,1,31,2],[31,3,31,5],[32,1,32,2],[32,3,32,5],[33,1,33,2],[33,3,33,5]]}
["K-12CVAT -  Analyst Report",{"$nulls":6},{"$f":"'K-12CVAT'!E1","v":"Version 3.0"}]
[]
["Instructions"]
["Step 1: Select the security framework used at your institution in cell B10. Step 2: Convert qualitative vendor responses into quantitative values, starting at cell G32. Step 3: Review converted values, ensuring full population of report. Step 4: Move to the Summary Report tab."]
["Vendor Name",{"$f":"'K-12CVAT'!C7","v":"Vendor Name"},null,null,"Product Name",{"$f":"'K-12CVAT'!C8","v":"Product Name and Version Information"}]
["Vendor Contact Name",{"$f":"'K-12CVAT'!C11","v":"Vendor Contact Name"},null,null,"Product Description",{"$f":"'K-12CVAT'!C9","v":"Brief Description of the Product"}]
["Vendor Contact Title",{"$f":"'K-12CVAT'!C12","v":"Vendor Contact Title"},null,null,"CVAT Version","Lite 3.0"]
["Vendor Email Address",{"$f":"'K-12CVAT'!C13","v":"Vendor Contact E-mail Address"},null,null,"Date Prepared",{"$f":"'K-12CVAT'!C3","v":"mm/dd/yyyy"}]
[]
["Institution's Security Framework","NIST Cybersecurity Framework",{"$f":"IF(B10=\"\",\"< - Select security framework.\",\"\")","v":""}]
{"$rows_left_out":44}
{"sheet":"Analyst Reference","index":6,"n_rows":99,"n_cols":6,"rows_kept":99,"merged":[[0,0,0,3],[1,0,1,3],[19,0,19,3],[20,0,20,3],[21,0,21,1],[28,0,28,1],[38,0,38,1],[47,0,47,1],[52,0,52,1],[57,0,57,1],[61,0,61,1],[68,0,68,1],[70,0,70,1],[74,0,74,1],[78,0,78,1],[83,0,83,1],[86,0,86,1],[91,0,91,1],[95,0,95,1]]}
["K-12 Community Vendor Assessment Tool (K-12CVAT) - Lite - Analyst Reference"]
{"$rows_empty":18}
["Instructions"]
["Use this reference guide to assess vendor responses in relation to your institution's environment. The context of K-12CVAT questions can change, depending on implementation specifics so these recommendations and follow-up response are not exhaustive and are meant to improve assessment and report capabilities within your institution's security/risk assessment program. \n\nAnalyst tip #1: For any answer that is deemed \"non-compliant\" by your institution, ask the vendor if there is a timeline for implementation, a sincere commitment to customer development engagement, and/or possible implementation of compensating control(s) that offsite the risks of another component.\n\nAnalyst tip #2: If a vendor's response to a follow-up inquiry is vague or seems off-point or dismissive, respond back to the vendor contact with clear expectations for a response. Responses that fail to meet expectations thereafter should be negatively assessed based on your institution's risk tolerance and the criticality of the data involved.\n\nAnalyst tip #3: The most important tip - reject a K-12CVAT from a vendor if; the vendor provides the institution with a insufficiently populated K-12CVAT; or the vendor responses are vague and/or do not answer questions directly; or significant discrepancies are found, making the K-12CVAT difficult to assess. "]
["Documentation",null,"Reason for Question","Follow-up Inquiries/Responses"]
[{"$f":"'K-12CVAT'!A23","v":"DOCU-01"},{"$f":"VLOOKUP(A23,'K-12CVAT'!A$23:B$99,2,FALSE)","v":"Have you undergone a SSAE 18 audit?"},"Standard documentation, relevant to institutions requiring a vendor to undergo SSAE 16 audits.","Follow-up inquiries for SSAE 16 content will be institution/implementation specific. "]
[{"$f":"'K-12CVAT'!A24","v":"DOCU-02"},{"$f":"VLOOKUP(A24,'K-12CVAT'!A$23:B$99,2,FALSE)","v":"Have you completed the Cloud Security Alliance (CSA) self assessment or CAIQ?"},"Many vendors have populated a CAIQ or at least a self-assessment. Although lacking in some areas important to Higher Ed, these documents are useful for supplemental assessment.","Follow-up inquiries for CSA content will be institution/implementation specific."]
[{"$f":"'K-12CVAT'!A25","v":"DOCU-03"},{"$f":"VLOOKUP(A25,'K-12CVAT'!A$23:B$99,2,FALSE)","v":"Have you received the Cloud Security Alliance STAR certification?"},"If a vendor is STAR certified, vendor responses can theoretically be more trusted since CSA has verified their responses. Trust, but verify for yourself, as needed.","If STAR certification is important to your institution you may have specific follow-up details for documentation purposes."]
[{"$f":"'K-12CVAT'!A26","v":"DOCU-04"},{"$f":"VLOOKUP(A26,'K-12CVAT'!A$23:B$99,2,FALSE)","v":"Do you conform with a specific industry standard security framework? (e.g. NIST Cybersecurity Framework, ISO 27001, etc.) Please identify which one under \"additional information\""},"The details of the standard are not the focus here, it is the fact that a vendor builds their environment around a standard and that they continually evaluate and assess their security programs.","In an ideal world, a vendor will conform to an industry framework that is adopted by an institution. When this synergy does not exist, the interpretation of the vendor's responses must be interpreted in the context of the institution's environment. Follow-up inquires for industry frameworks (and levels of adoption) will be institution/implementation specific."]
[{"$f":"'K-12CVAT'!A27","v":"DOCU-05"},{"$f":"VLOOKUP(A27,'K-12CVAT'!A$23:B$99,2,FALSE)","v":"Are you compliant with FISMA standards?"},"For institutions that collaborate with the United States government, FISMA compliance may be required. ","Follow-up inquiries for FISMA compliance will be institution/implementation specific. "]
{"$rows_left_out":73}
{"sheet":"Summary Report","index":7,"n_rows":62,"n_cols":7,"rows_kept":62,"merged":[[0,0,0,5],[0,6,0,7],[1,0,1,7],[2,1,2,2],[2,4,2,7],[3,1,3,7],[4,0,5,2],[4,3,4,4],[4,5,5,7],[27,0,27,7],[28,0,28,2],[28,3,28,7]]}
["K-12CVAT - Lite - Summary Report",{"$nulls":5},{"$f":"'K-12CVAT'!E1","v":"Version 3.0"}]
[]
["Vendor",{"$f":"'K-12CVAT'!C7","v":"Vendor Name"},null,"Product",{"$f":"'K-12CVAT'!C8","v":"Product Name and Version Information"}]
["Description",{"$f":"'K-12CVAT'!C9","v":"Brief Description of the Product"}]
[{"$nulls":3},"Overall Score:"]
[{"$nulls":3},{"$f":"Questions!X25","v":{"v":0,"d":"0%"}},{"$f":"Questions!W25","v":"F"}]
[]
[null,null,0,0.6,{"v":0.7,"d":"1"},0.8,0.9]
[null,null,0.6,0.7,{"v":0.8,"d":"1"},0.9,1]
[null,null,"F","D","C","B","A"]
{"$rows_left_out":53}
{"sheet":"Crosswalk Detail","index":8,"n_rows":662,"n_cols":2,"rows_kept":662,"hidden":true}
["5.1.1","Policies for information security"]
["5.1.2","Review of the policies for information security"]
["6.1.1","Information security roles and responsibilities"]
["6.1.2","Segregation of duties"]
["6.1.3","Contact with authorities"]
["6.1.4","Contact with special interest groups"]
["6.1.5","Information security in project management"]
["6.2.1","Mobile device policy"]
["6.2.2","Teleworking"]
["7.1.1","Screening"]
{"$rows_left_out":653}
{"sheet":"High Risk Non-Compliant","index":9,"n_rows":32,"n_cols":10,"rows_kept":32,"hidden":true}
["High Risk","TRUE"]
["Compliant",0]
[]
["Order","ID","Question","Additional Info","CIS","HIPAA","ISO 27002:27013","NIST Cybersecurity Framework","NIST SP 800-171r1","NIST SP 800-53r4"]
[4,"DOCU-04","Do you conform with a specific industry standard security framework? (e.g. NIST Cybersecurity Framework, ISO 27001, etc.) Please identify which one under \"additional information\"",0,0,0,"18.1.1",0,0,"SA-9"]
[6,"DOCU-06","Would you sign the Student Data Privacy Consortium statement for the state in which our district is located? (https://sdpc.a4l.org/) ",0,0,"§164.308(a)(1)(i)","18.1.4","ID.GV-3","ID.GV-3","SA-9"]
[15,"HLAP-01","Does you system support various permission levels (for example, role based access control) for end users?",0,"CSC 14",0,"9.2.2","PR.AC-4","3.1.1, 3.1.2, 3.1.7","AC-2, AC-3, AC-6"]
[16,"HLAP-02","Do you enforce additional security controls for privileged access users (e.g. system administrators)? ",0,"CSC 16",0,"9.1.1","PR.AC-4, PR.PT-3","3.4.9","CM-11"]
[24,"HLAA-02","Does your web-based interface support authentication, including standards-based single-sign-on? (e.g. SAMAL, OAuth, ClassLink, etc.)",0,"CSC 16",0,"9.1.1, 9.2.3, 9.3.1, 9.4.3","PR.AC-1","3.5.1","IA-2, IA-5"]
[31,"HLCH-01","Do you have a documented and currently followed change management process (CMP) for standard and emergency changes? ",0,"CSC 10",0,"12.1.2","PR.IP-3","3.4.3, 3.4.4","CM-3, CM-4, CM-5"]
{"$rows_left_out":23}
{"sheet":"Questions","index":10,"n_rows":62,"n_cols":28,"rows_kept":62,"hidden":true}
["Order","ID","Question","Additional Info","High Risk","Required","Category","Compliant Answer","Vendor Answer","Compliant","Weight","Score","CIS","HIPAA","ISO 27002:27013","NIST Cybersecurity Framework","NIST SP 800-171r1","NIST SP 800-53r4",null,"Category_Total","Category_divisor","Score","Max_Score","Score %"]
[1,"DOCU-01",{"$f":"VLOOKUP(B2,'K-12CVAT'!A:E,2,FALSE)","v":"Have you undergone a SSAE 18 audit?"},{"$f":"VLOOKUP(B2,'K-12CVAT'!A:E,4,FALSE)","v":0},{"$f":"IF(K2>20,TRUE,FALSE)","v":false},1,"Documentation","Yes",{"$f":"VLOOKUP(B2,'K-12CVAT'!$A$6:$C$318,3,FALSE)","v":0},{"$f":"IF(ISNUMBER(FIND(H2,I2)), 1, 0)","v":0},15,{"$f":"J2*K2","v":0},{"$f":"VLOOKUP($B2,'Standards Crosswalk'!$A:$H,3,FALSE)","v":0},{"$f":"VLOOKUP($B2,'Standards Crosswalk'!$A:$H,4,FALSE)","v":0},{"$f":"VLOOKUP($B2,'Standards Crosswalk'!$A:$H,5,FALSE)","v":"15.2.1"},{"$f":"VLOOKUP($B2,'Standards Crosswalk'!$A:$H,6,FALSE)","v":0},{"$f":"VLOOKUP($B2,'Standards Crosswalk'!$A:$H,7,FALSE)","v":0},{"$f":"VLOOKUP($B2,'Standards Crosswalk'!$A:$H,8,FALSE)","v":"SA-9"},"Documentation",{"$f":"COUNTIFS(B:B,\"DOCU*\",J:J,\"=1\")","v":0},{"$f":"COUNTIF(B:B,\"DOCU*\")","v":6},{"$f":"SUMIFS(L:L,B:B, \"DOCU*\")","v":0},{"$f":"SUMIFS(K:K,B:B, \"DOCU*\")","v":100},{"$f":"V2/W2","v":{"v":0,"d":"0.00%"}},"High Risk Non-Compliant",{"$f":"COUNTIFS(E:E,\"TRUE\",J:J,\"<1\")","v":28},"% High Risk non-compliant",{"$f":"Z2/Z4","v":1}]
[{"$f":"A2+1","v":2},"DOCU-02",{"$f":"VLOOKUP(B3,'K-12CVAT'!A:E,2,FALSE)","v":"Have you completed the Cloud Security Alliance (CSA) self assessment or CAIQ?"},{"$f":"VLOOKUP(B3,'K-12CVAT'!A:E,4,FALSE)","v":0},false,1,"Documentation","Yes",{"$f":"VLOOKUP(B3,'K-12CVAT'!$A$6:$C$318,3,FALSE)","v":0},0,10,0,{"$f":"VLOOKUP($B3,'Standards Crosswalk'!$A:$H,3,FALSE)","v":0},{"$f":"VLOOKUP($B3,'Standards Crosswalk'!$A:$H,4,FALSE)","v":0},{"$f":"VLOOKUP($B3,'Standards Crosswalk'!$A:$H,5,FALSE)","v":"15.2.1"},{"$f":"VLOOKUP($B3,'Standards Crosswalk'!$A:$H,6,FALSE)","v":0},{"$f":"VLOOKUP($B3,'Standards Crosswalk'!$A:$H,7,FALSE)","v":0},{"$f":"VLOOKUP($B3,'Standards Crosswalk'!$A:$H,8,FALSE)","v":"PE-2, PE-3, PE-5, PE-11, PE-13, PE-14, SA-9"},"Company",{"$f":"COUNTIFS(B:B,\"COMP*\",J:J,\"=1\")","v":0},{"$f":"COUNTIF(B:B,\"COMP*\")","v":8},{"$f":"SUMIFS(L:L,B:B, \"COMP*\")","v":0},{"$f":"SUMIFS(K:K,B:B, \"COMP*\")","v":120},{"v":0,"d":"0.00%"},"Low Risk Non-Compliant",{"$f":"COUNTIFS(E:E,\"FALSE\",J:J,\"<1\")","v":33},"% Low Risk non-compliant",1]
[3,"DOCU-03",{"$f":"VLOOKUP(B4,'K-12CVAT'!A:E,2,FALSE)","v":"Have you received the Cloud Security Alliance STAR certification?"},{"$f":"VLOOKUP(B4,'K-12CVAT'!A:E,4,FALSE)","v":0},false,1,"Documentation","Yes",{"$f":"VLOOKUP(B4,'K-12CVAT'!$A$6:$C$318,3,FALSE)","v":0},0,15,0,{"$f":"VLOOKUP($B4,'Standards Crosswalk'!$A:$H,3,FALSE)","v":0},{"$f":"VLOOKUP($B4,'Standards Crosswalk'!$A:$H,4,FALSE)","v":0},{"$f":"VLOOKUP($B4,'Standards Crosswalk'!$A:$H,5,FALSE)","v":"15.2.1"},{"$f":"VLOOKUP($B4,'Standards Crosswalk'!$A:$H,6,FALSE)","v":0},{"$f":"VLOOKUP($B4,'Standards Crosswalk'!$A:$H,7,FALSE)","v":0},{"$f":"VLOOKUP($B4,'Standards Crosswalk'!$A:$H,8,FALSE)","v":"PE-2, PE-3, PE-5, PE-11, PE-13, PE-14, SA-9"},"Application Security",{"$f":"COUNTIFS(B:B,\"HLAP*\",J:J,\"=1\")","v":0},{"$f":"COUNTIF(B:B,\"HLAP*\")","v":8},{"$f":"SUMIFS(L:L,B:B, \"HLAP*\")","v":0},{"$f":"SUMIFS(K:K,B:B, \"HLAP*\")","v":150},{"v":0,"d":"0.00%"},"High Risk Total",{"$f":"COUNTIF(E:E,\"TRUE\")","v":28}]
[4,"DOCU-04",{"$f":"VLOOKUP(B5,'K-12CVAT'!A:E,2,FALSE)","v":"Do you conform with a specific industry standard security framework? (e.g. NIST Cybersecurity Framework, ISO 27001, etc.) Please identify which one under \"additional information\""},{"$f":"VLOOKUP(B5,'K-12CVAT'!A:E,4,FALSE)","v":0},true,1,"Documentation","Yes",{"$f":"VLOOKUP(B5,'K-12CVAT'!$A$6:$C$318,3,FALSE)","v":0},0,25,0,{"$f":"VLOOKUP($B5,'Standards Crosswalk'!$A:$H,3,FALSE)","v":0},{"$f":"VLOOKUP($B5,'Standards Crosswalk'!$A:$H,4,FALSE)","v":0},{"$f":"VLOOKUP($B5,'Standards Crosswalk'!$A:$H,5,FALSE)","v":"18.1.1"},{"$f":"VLOOKUP($B5,'Standards Crosswalk'!$A:$H,6,FALSE)","v":0},{"$f":"VLOOKUP($B5,'Standards Crosswalk'!$A:$H,7,FALSE)","v":0},{"$f":"VLOOKUP($B5,'Standards Crosswalk'!$A:$H,8,FALSE)","v":"SA-9"},"Authentication, Authorization, and Accounting",{"$f":"COUNTIFS(B:B,\"HLAA*\",J:J,\"=1\")","v":0},{"$f":"COUNTIF(B:B,\"HLAA*\")","v":4},{"$f":"SUMIFS(L:L,B:B, \"HLAA*\")","v":0},{"$f":"SUMIFS(K:K,B:B, \"HLAA*\")","v":85},{"v":0,"d":"0.00%"},"Low Risk Total",{"$f":"COUNTIF(E2:E185,\"FALSE\")","v":33}]
[5,"DOCU-05",{"$f":"VLOOKUP(B6,'K-12CVAT'!A:E,2,FALSE)","v":"Are you compliant with FISMA standards?"},{"$f":"VLOOKUP(B6,'K-12CVAT'!A:E,4,FALSE)","v":0},false,1,"Documentation","Yes",{"$f":"VLOOKUP(B6,'K-12CVAT'!$A$6:$C$318,3,FALSE)","v":0},0,10,0,{"$f":"VLOOKUP($B6,'Standards Crosswalk'!$A:$H,3,FALSE)","v":0},{"$f":"VLOOKUP($B6,'Standards Crosswalk'!$A:$H,4,FALSE)","v":0},{"$f":"VLOOKUP($B6,'Standards Crosswalk'!$A:$H,5,FALSE)","v":"18.1.1"},{"$f":"VLOOKUP($B6,'Standards Crosswalk'!$A:$H,6,FALSE)","v":0},{"$f":"VLOOKUP($B6,'Standards Crosswalk'!$A:$H,7,FALSE)","v":0},{"$f":"VLOOKUP($B6,'Standards Crosswalk'!$A:$H,8,FALSE)","v":"SA-9"},"Business Continuity",{"$f":"COUNTIFS(B:B,\"HLBC*\",J:J,\"=1\")","v":0},{"$f":"COUNTIF(B:B,\"HLBC*\")","v":4},{"$f":"SUMIFS(L:L,B:B, \"HLBC*\")","v":0},{"$f":"SUMIFS(K:K,B:B, \"HLBC*\")","v":55},{"v":0,"d":"0.00%"}]
[6,"DOCU-06",{"$f":"VLOOKUP(B7,'K-12CVAT'!A:E,2,FALSE)","v":"Would you sign the Student Data Privacy Consortium statement for the state in which our district is located? (https://sdpc.a4l.org/) "},{"$f":"VLOOKUP(B7,'K-12CVAT'!A:E,4,FALSE)","v":0},true,1,"Documentation","Yes",{"$f":"VLOOKUP(B7,'K-12CVAT'!$A$6:$C$318,3,FALSE)","v":0},0,25,0,{"$f":"VLOOKUP($B7,'Standards Crosswalk'!$A:$H,3,FALSE)","v":0},{"$f":"VLOOKUP($B7,'Standards Crosswalk'!$A:$H,4,FALSE)","v":"§164.308(a)(1)(i)"},{"$f":"VLOOKUP($B7,'Standards Crosswalk'!$A:$H,5,FALSE)","v":"18.1.4"},{"$f":"VLOOKUP($B7,'Standards Crosswalk'!$A:$H,6,FALSE)","v":"ID.GV-3"},{"$f":"VLOOKUP($B7,'Standards Crosswalk'!$A:$H,7,FALSE)","v":"ID.GV-3"},{"$f":"VLOOKUP($B7,'Standards Crosswalk'!$A:$H,8,FALSE)","v":"SA-9"},"Change Management",{"$f":"COUNTIFS(B:B,\"HLCH*\",J:J,\"=1\")","v":0},{"$f":"COUNTIF(B:B,\"HLCH*\")","v":3},{"$f":"SUMIFS(L:L,B:B, \"HLCH*\")","v":0},{"$f":"SUMIFS(K:K,B:B, \"HLCH*\")","v":65},{"v":0,"d":"0.00%"}]
[7,"COMP-01",{"$f":"VLOOKUP(B8,'K-12CVAT'!A:E,2,FALSE)","v":"Describe your organization’s business background and ownership structure, including all parent and subsidiary relationships."},{"$f":"VLOOKUP(B8,'K-12CVAT'!A:E,4,FALSE)","v":0},false,1,"Company Overview",null,null,{"$f":"IF(VLOOKUP(B8,'Analyst Report'!A$32:G$51,7,FALSE)=\"Yes\",1,0)","v":0},10,0,{"$f":"VLOOKUP($B8,'Standards Crosswalk'!$A:$H,3,FALSE)","v":0},{"$f":"VLOOKUP($B8,'Standards Crosswalk'!$A:$H,4,FALSE)","v":0},{"$f":"VLOOKUP($B8,'Standards Crosswalk'!$A:$H,5,FALSE)","v":0},{"$f":"VLOOKUP($B8,'Standards Crosswalk'!$A:$H,6,FALSE)","v":0},{"$f":"VLOOKUP($B8,'Standards Crosswalk'!$A:$H,7,FALSE)","v":0},{"$f":"VLOOKUP($B8,'Standards Crosswalk'!$A:$H,8,FALSE)","v":0}]
[8,"COMP-02",{"$f":"VLOOKUP(B9,'K-12CVAT'!A:E,2,FALSE)","v":"Describe how long your organization has conducted business in this product area."},{"$f":"VLOOKUP(B9,'K-12CVAT'!A:E,4,FALSE)","v":0},false,1,"Company Overview",null,null,{"$f":"IF(VLOOKUP(B9,'Analyst Report'!A$32:G$51,7,FALSE)=\"Yes\",1,0)","v":0},10,0,{"$f":"VLOOKUP($B9,'Standards Crosswalk'!$A:$H,3,FALSE)","v":0},{"$f":"VLOOKUP($B9,'Standards Crosswalk'!$A:$H,4,FALSE)","v":0},{"$f":"VLOOKUP($B9,'Standards Crosswalk'!$A:$H,5,FALSE)","v":0},{"$f":"VLOOKUP($B9,'Standards Crosswalk'!$A:$H,6,FALSE)","v":0},{"$f":"VLOOKUP($B9,'Standards Crosswalk'!$A:$H,7,FALSE)","v":0},{"$f":"VLOOKUP($B9,'Standards Crosswalk'!$A:$H,8,FALSE)","v":0}]
[9,"COMP-03",{"$f":"VLOOKUP(B10,'K-12CVAT'!A:E,2,FALSE)","v":"Do you have existing K-12 customers?"},{"$f":"VLOOKUP(B10,'K-12CVAT'!A:E,4,FALSE)","v":0},false,1,"Company Overview","Yes",{"$f":"VLOOKUP(B10,'K-12CVAT'!$A$6:$C$318,3,FALSE)","v":0},{"$f":"IF(ISNUMBER(FIND(H10,I10)), 1, 0)","v":0},15,0,{"$f":"VLOOKUP($B10,'Standards Crosswalk'!$A:$H,3,FALSE)","v":0},{"$f":"VLOOKUP($B10,'Standards Crosswalk'!$A:$H,4,FALSE)","v":0},{"$f":"VLOOKUP($B10,'Standards Crosswalk'!$A:$H,5,FALSE)","v":"15.2.1"},{"$f":"VLOOKUP($B10,'Standards Crosswalk'!$A:$H,6,FALSE)","v":0},{"$f":"VLOOKUP($B10,'Standards Crosswalk'!$A:$H,7,FALSE)","v":0},{"$f":"VLOOKUP($B10,'Standards Crosswalk'!$A:$H,8,FALSE)","v":0},"Data",{"$f":"COUNTIFS(B:B,\"HLDA*\",J:J,\"=1\")","v":0},{"$f":"COUNTIF(B:B,\"HLDA*\")","v":6},{"$f":"SUMIFS(L:L,B:B, \"HLDA*\")","v":0},{"$f":"SUMIFS(K:K,B:B, \"HLDA*\")","v":225},{"$f":"V10/W10","v":{"v":0,"d":"0.00%"}}]
{"$rows_left_out":53}
{"sheet":"Values","index":11,"n_rows":64,"n_cols":2,"rows_kept":64,"hidden":true}
["Campus"]
[]
["Answers"]
["Yes"]
["No"]
["N/A"]
[]
["DRPTestingSchedule"]
["Quarterly"]
["Semi-annually"]
{"$rows_left_out":55}
{"sheet":"ChangeLog","index":12,"n_rows":5,"n_cols":3,"rows_kept":5,"merged":[[0,0,0,2],[1,0,1,2]]}
["K-12  Community Vendor Assessment Toolkit - Lite - Change Log"]
[]
["Version","Date","Description of Change"]
["v0.1","2022-03-01","Adapted original HECVAT-Lite to K-12 model, updated language and made attribution to original work provided by Educause"]
["v3.0","2022-11-30","K-12CVAT 3.0 version released to the public by CoSN"]