{"text_format":"3","workbook":"xlsx","n_sheets":10,"sheets":["Read Me","1. Staff_Headcount","2. Salaries_&_Wages","3. Payroll_Taxes_&_Benefits","4. Corporate_&_Misc_Costs","5. Insurance & Bond","6. Variable_Costs","7. Fixed_Costs","8. Transition & Startup","9. Summary"],"not_rendered":{"defined_names":12},"read":"whole","date_system":"1900"}

{"sheet":"Read Me","index":0,"n_rows":14,"n_cols":1,"rows_kept":14}
["This pricing form is provided as an example and template for PROPOSERS to use when generating price PROPOSALS in response to Transit Operations and Maintenance Services. The workbook includes numerous formulas and links, and is not password protected. PROPOSERS should take care to ensure that all formulas and links are correct when PROPOSALS are submitted. Price PROPOSALS must be submitted in un-protected executable Excel format with all appropriate formulas and links, to enable complete cost analysis. Password protected price PROPOSALS may be considered non-responsive, unless approved by RABA prior to submittal."]
[]
["For questions regarding the pricing form, please contact Link Transit Manager @ jandoh@burlingtonnc.gov"]
[]
["Pricing Form Instructions:"]
["1. Complete the Staff Headcount worksheet for all base and option years. Indicate the actual number of staff planned for each position for each year. Add, remove or modify positions as needed."]
["2. Complete the Salaries & Wages worksheet.The list of positions should update automatically based on changes to the positions listed on the Headcount worksheet. Update links and formulas as needed."]
["3. Complete the Payroll Taxes & Benefits worksheet.The list of positions should update automatically based on changes to the positions listed on the Headcount worksheet. Update links and formulas as needed."]
["4. Complete the Corporate & Misc. Costs worksheet. In Column B, indicate whether each cost is variable or fixed. Add, remove or modify cost items as needed. Update links and formulas as needed."]
["5. Complete the Variable Costs Worksheet. Include all variable cost subtotals for each contract year. Update links and formulas as needed."]
{"$rows_left_out":5}
{"sheet":"1. Staff_Headcount","index":1,"n_rows":32,"n_cols":9,"rows_kept":32,"merged":[[0,0,1,0]]}
["Position Headcount","Base Year 1","Base Year 2","Base Year 3","Option Year 4","Option Year 5","Base Term Increase","Option Years Increase","5-Year Increase"]
[null,"7/1/2025-6/30/2026","7/1/2026-6/30/2027","7/1/2027-6/30/2028","7/1/2028-6/30/2029","7/1/2029-6/30/2030","7/1/2025-6/30/2028","7/1/2028-6/30/2030","7/1/2025-6/30/2030"]
["Position","Headcount","Headcount","Headcount","Headcount","Headcount","Net Increase","Net Increase","Net Increase"]
["Management:"]
["General Manager",{"v":1,"d":"1.0"},{"$nulls":4},{"$f":"MAX(B5:D5)-MIN(B5:D5)","v":0},{"$f":"MAX(E5:F5)-MIN(E5:F5)","v":0},{"$f":"MAX(B5:F5)-MIN(B5:F5)","v":0}]
["Maintenance Manager",{"v":1,"d":"1.0"},{"$nulls":4},{"$f":"MAX(B6:D6)-MIN(B6:D6)","v":0},{"$f":"MAX(E6:F6)-MIN(E6:F6)","v":0},{"$f":"MAX(B6:F6)-MIN(B6:F6)","v":0}]
["Operations & Safety Manager",{"v":1,"d":"1.0"},{"$nulls":4},{"$f":"MAX(B7:D7)-MIN(B7:D7)","v":0},{"$f":"MAX(E7:F7)-MIN(E7:F7)","v":0},{"$f":"MAX(B7:F7)-MIN(B7:F7)","v":0}]
[]
[]
[]
{"$rows_left_out":23}
{"sheet":"2. Salaries_&_Wages","index":2,"n_rows":42,"n_cols":41,"rows_kept":42,"merged":[[0,0,1,0],[0,1,0,5],[0,6,0,10],[0,11,0,15],[0,16,0,20],[0,21,0,25],[0,26,0,30],[0,31,0,35],[0,36,0,40],[1,1,1,5],[1,6,1,10],[1,11,1,15],[1,16,1,20],[1,21,1,25],[1,26,1,30],[1,31,1,35],[1,36,1,40],[37,1,37,2],[37,6,37,7],[37,11,37,12],[37,16,37,17],[37,21,37,22]]}
["Salaries & Wages","Base Year 1",{"$nulls":4},"Base Year 2",{"$nulls":4},"Base Year 3",{"$nulls":4},"Option Year 4",{"$nulls":4},"Option Year 5",{"$nulls":4},"Base Term Totals",{"$nulls":4},"Option Year Totals",{"$nulls":4},"5-Year Totals"]
[null,"7/1/2025-6/30/2026",{"$nulls":4},"7/1/2026-6/30/2027",{"$nulls":4},"7/1/2027-6/30/2028",{"$nulls":4},"7/1/2028-6/30/2029",{"$nulls":4},"7/1/2029-6/30/2030",{"$nulls":4},"7/1/2025-6/30/2028",{"$nulls":4},"7/1/2028-6/30/2030",{"$nulls":4},"7/1/2025-6/30/2030"]
["Position","Salary/Wage","Hours*","Fixed Cost†","Hours-Based†","Total","Salary/Wage","Hours","Fixed Cost","Hours-Based","Total","Salary/Wage","Hours","Fixed Cost","Hours-Based","Total","Salary/Wage","Hours","Fixed Cost","Hours-Based","Total","Salary/Wage","Hours","Fixed Cost","Hours-Based","Total","Salary/Wage Δ","Hours","Fixed Cost","Hours-Based","Total","Salary/Wage Δ","Hours","Fixed Cost","Hours-Based","Total","Salary/Wage Δ","Hours","Fixed Cost","Hours-Based","Total"]
["Management:"]
["General Manager",0,{"$f":"2080*'1. Staff_Headcount'!B5","v":{"v":2080,"d":"2,080.0"}},{"$f":"B5","v":0},null,{"$f":"D5+E5","v":0},{"$nulls":4},{"$f":"SUM(I5:J5)","v":0},{"$nulls":4},{"$f":"SUM(N5:O5)","v":0},{"$nulls":4},{"$f":"SUM(S5:T5)","v":0},{"$nulls":4},{"$f":"SUM(X5:Y5)","v":0},{"$f":"MAX(B5,G5,L5)- MIN(B5,G5,L5)","v":0},{"$f":" SUM(C5,H5,M5)","v":{"v":2080,"d":"2,080.0"}},null,null,{"$f":"SUM(AC5:AD5)","v":0},{"$f":"MAX(Q5,V5)-MIN(,Q5,V5)","v":0},{"$f":"SUM(R5,W5)","v":0},null,null,{"$f":"SUM(AH5:AI5)","v":0},{"$f":"MAX(B5,G5,L5,Q5,V5)-MIN(B5,G5,L5,Q5,V5)","v":0},{"$f":"AB5+AG5","v":{"v":2080,"d":"2,080.0"}},null,null,{"$f":"SUM(AM5:AN5)","v":0}]
["Maintenance Manager",0,{"$f":"2080*'1. Staff_Headcount'!B6","v":{"v":2080,"d":"2,080.0"}},{"$f":"B6","v":0},null,{"$f":"D6+E6","v":0},{"$nulls":4},{"$f":"SUM(I6:J6)","v":0},{"$nulls":4},{"$f":"SUM(N6:O6)","v":0},{"$nulls":4},{"$f":"SUM(S6:T6)","v":0},{"$nulls":4},{"$f":"SUM(X6:Y6)","v":0},{"$f":"MAX(B6,G6,L6)- MIN(B6,G6,L6)","v":0},{"$f":" SUM(C6,H6,M6)","v":{"v":2080,"d":"2,080.0"}},null,null,{"$f":"SUM(AC6:AD6)","v":0},{"$f":"MAX(Q6,V6)-MIN(,Q6,V6)","v":0},{"$f":"SUM(R6,W6)","v":0},null,null,{"$f":"SUM(AH6:AI6)","v":0},{"$f":"MAX(B6,G6,L6,Q6,V6)-MIN(B6,G6,L6,Q6,V6)","v":0},{"$f":"AB6+AG6","v":{"v":2080,"d":"2,080.0"}},null,null,{"$f":"SUM(AM6:AN6)","v":0}]
[{"$f":"'1. Staff_Headcount'!A7","v":"Operations & Safety Manager"},0,{"$f":"2080*'1. Staff_Headcount'!B7","v":{"v":2080,"d":"2,080.0"}},0,null,0,{"$nulls":4},0,{"$nulls":4},0,{"$nulls":4},0,{"$nulls":4},0,0,{"v":2080,"d":"2,080.0"},null,null,0,0,0,null,null,0,0,{"v":2080,"d":"2,080.0"},null,null,0]
[{"$f":"'1. Staff_Headcount'!A8","v":0},0,{"$f":"2080*'1. Staff_Headcount'!B8","v":0},0,null,0,{"$nulls":4},0,{"$nulls":4},0,{"$nulls":4},0,{"$nulls":4},0,0,0,null,null,0,0,0,null,null,0,0,0,null,null,0]
[{"$f":"'1. Staff_Headcount'!A9","v":0},0,{"$f":"2080*'1. Staff_Headcount'!B9","v":0},0,null,0,{"$nulls":4},0,{"$nulls":4},0,{"$nulls":4},0,{"$nulls":4},0,0,0,null,null,0,0,0,null,null,0,0,0,null,null,0]
[{"$f":"'1. Staff_Headcount'!A10","v":0},0,{"$f":"2080*'1. Staff_Headcount'!B10","v":0},0,null,0,{"$nulls":4},0,{"$nulls":4},0,{"$nulls":4},0,{"$nulls":4},0,0,0,null,null,0,0,0,null,null,0,0,0,null,null,0]
{"$rows_left_out":33}
{"sheet":"3. Payroll_Taxes_&_Benefits","index":3,"n_rows":34,"n_cols":25,"rows_kept":34,"merged":[[0,0,1,0],[0,1,0,3],[0,4,0,6],[0,7,0,9],[0,10,0,12],[0,13,0,15],[0,16,0,18],[0,19,0,21],[0,22,0,24],[1,1,1,3],[1,4,1,6],[1,7,1,9],[1,10,1,12],[1,13,1,15],[1,16,1,18],[1,19,1,21],[1,22,1,24],[31,1,31,2],[31,4,31,5],[31,7,31,8],[31,10,31,11],[31,13,31,14]]}
["Payroll Taxes & \nEmployer-Paid Benefits","Base Year 1",null,null,"Base Year 2",null,null,"Base Year 3",null,null,"Option Year 4",null,null,"Option Year 5",null,null,"Base Term Totals",null,null,"Option Years Totals",null,null,"5-Year Totals"]
[null,"7/1/2025-6/30/2026",null,null,"7/1/2026-6/30/2027",null,null,"7/1/2027-6/30/2028",null,null,"7/1/2028-6/30/2029",null,null,"7/1/2029-6/30/2030",null,null,"7/1/2025-6/30/2028",null,null,"7/1/2028-6/30/2030",null,null,"7/1/2025-6/30/2030"]
["Position","Taxes*","Benefits*","Total","Taxes","Benefits","Total","Taxes","Benefits","Total","Taxes","Benefits","Total","Taxes","Benefits","Total","Taxes","Benefits","Total","Taxes","Benefits","Total","Taxes","Benefits","Total"]
["Management:"]
[{"$f":"'2. Salaries_&_Wages'!A5","v":"General Manager"},null,null,{"$f":"SUM(B5,C5)","v":0},null,null,{"$f":"SUM(E5,F5)","v":0},null,null,{"$f":"SUM(H5,I5)","v":0},null,null,{"$f":"SUM(K5,L5)","v":0},null,null,{"$f":"SUM(N5,O5)","v":0},{"$f":" SUM(B5,E5,H5)","v":0},{"$f":" SUM(C5,F5,I5)","v":0},{"$f":"Q5+R5","v":0},{"$f":"SUM(K5,N5)","v":0},{"$f":"SUM(L5,O5)","v":0},{"$f":"T5+U5","v":0},{"$f":"Q5+T5","v":0},{"$f":"R5+U5","v":0},{"$f":"W5+X5","v":0}]
[{"$f":"'2. Salaries_&_Wages'!A6","v":"Maintenance Manager"},null,null,{"$f":"SUM(B6,C6)","v":0},null,null,{"$f":"SUM(E6,F6)","v":0},null,null,{"$f":"SUM(H6,I6)","v":0},null,null,{"$f":"SUM(K6,L6)","v":0},null,null,{"$f":"SUM(N6,O6)","v":0},{"$f":" SUM(B6,E6,H6)","v":0},{"$f":" SUM(C6,F6,I6)","v":0},{"$f":"Q6+R6","v":0},{"$f":"SUM(K6,N6)","v":0},{"$f":"SUM(L6,O6)","v":0},{"$f":"T6+U6","v":0},{"$f":"Q6+T6","v":0},{"$f":"R6+U6","v":0},{"$f":"W6+X6","v":0}]
[{"$f":"'2. Salaries_&_Wages'!A7","v":"Operations & Safety Manager"},null,null,0,null,null,0,null,null,0,null,null,0,null,null,0,0,0,0,0,0,0,0,0,0]
[{"$f":"'2. Salaries_&_Wages'!A8","v":0},null,null,0,null,null,0,null,null,0,null,null,0,null,null,0,0,0,0,0,0,0,0,0,0]
[{"$f":"'2. Salaries_&_Wages'!A9","v":0},null,null,0,null,null,0,null,null,0,null,null,0,null,null,0,0,0,0,0,0,0,0,0,0]
[{"$f":"'2. Salaries_&_Wages'!A10","v":0},null,null,0,null,null,0,null,null,0,null,null,0,null,null,0,0,0,0,0,0,0,0,0,0]
{"$rows_left_out":25}
{"sheet":"4. Corporate_&_Misc_Costs","index":4,"n_rows":33,"n_cols":10,"rows_kept":33,"merged":[[0,0,1,1]]}
["Corporate & Miscellaneous Costs",null,"Base Year 1","Base Year 2","Base Year 3","Option Year 4","Option Year 5","Base Term Increase","Option Years Increase","5-Year Increase"]
[null,null,"7/1/2025-6/30/2026","7/1/2026-6/30/2027","7/1/2027-6/30/2028","7/1/2028-6/30/2029","7/1/2029-6/30/2030","7/1/2025-6/30/2028","7/1/2028-6/30/2030","7/1/2025-6/30/2030"]
["Item","Fixed/Var.","Cost","Cost","Cost","Cost","Cost","Cost","Cost","Cost"]
["Corporate Taxes",{"$nulls":6},{"$f":"SUM(C4:E4)","v":0},{"$f":"SUM(F4:G4)","v":0},{"$f":"SUM(H4:I4)","v":0}]
["Licenses",{"$nulls":6},{"$f":"SUM(C5:E5)","v":0},{"$f":"SUM(F5:G5)","v":0},{"$f":"SUM(H5:I5)","v":0}]
["Permits",{"$nulls":6},{"$f":"SUM(C6:E6)","v":0},{"$f":"SUM(F6:G6)","v":0},0]
["Office Equipment",{"$nulls":6},{"$f":"SUM(C7:E7)","v":0},{"$f":"SUM(F7:G7)","v":0},0]
["Office Furniture & Fixture",{"$nulls":6},{"$f":"SUM(C8:E8)","v":0},{"$f":"SUM(F8:G8)","v":0},0]
["Computer Equipment",{"$nulls":6},{"$f":"SUM(C9:E9)","v":0},{"$f":"SUM(F9:G9)","v":0},0]
["Computer Software",{"$nulls":6},{"$f":"SUM(C10:E10)","v":0},{"$f":"SUM(F10:G10)","v":0},0]
{"$rows_left_out":24}
{"sheet":"5. Insurance & Bond","index":5,"n_rows":33,"n_cols":14,"rows_kept":33,"merged":[[0,0,1,0],[0,1,0,2],[0,3,0,4],[0,5,0,6],[0,7,0,8],[0,9,0,10],[1,1,1,2],[1,3,1,4],[1,5,1,6],[1,7,1,8],[1,9,1,10]]}
[null,"Base Year 1",null,"Base Year 2",null,"Base Year 3",null,"Option Year 4",null,"Option Year 5",null,"Base Term Total","Option Years Total","5 Years Total"]
[null,"7/1/2025-6/30/2026",null,"7/1/2026-6/30/2027",null,"7/1/2027-6/30/2028",null,"7/1/2028-6/30/2029",null,"7/1/2029-6/30/2030",null,"7/1/2025-6/30/2028","7/1/2028-6/30/2030","7/1/2025-6/30/2030"]
["Item","Coverage Limit","Premium/Cost","Coverage Limit","Premium/Cost","Coverage Limit","Premium/Cost","Coverage Limit","Premium/Cost","Coverage Limit","Premium/Cost","Premium/Cost","Premium/Cost","Premium/Cost"]
["Performance Bond",{"$nulls":10},{"$f":" SUM(C4,E4,G4)","v":0},{"$f":"SUM(I4,K4)","v":0},{"$f":"SUM(L4:M4)","v":0}]
[{"$nulls":11},{"$f":" SUM(C5,E5,G5)","v":0},{"$f":"SUM(I5,K5)","v":0},{"$f":"SUM(L5:M5)","v":0}]
["General Liability",{"$nulls":10},0,0,0]
["Automobile Liability",{"$nulls":10},0,0,0]
["Worker's Compensation",{"$nulls":10},0,0,0]
["Employee Theft/Crime Insurance",{"$nulls":10},0,0,0]
[{"$nulls":11},0,0,0]
{"$rows_left_out":24}
{"sheet":"6. Variable_Costs","index":6,"n_rows":33,"n_cols":25,"rows_kept":33,"merged":[[0,0,1,0],[0,1,0,3],[0,4,0,6],[0,7,0,9],[0,10,0,12],[0,13,0,15],[0,16,0,18],[0,19,0,21],[0,22,0,24],[1,1,1,3],[1,4,1,6],[1,7,1,9],[1,10,1,12],[1,13,1,15],[1,16,1,18],[1,19,1,21],[1,22,1,24],[32,1,32,2],[32,4,32,5],[32,7,32,8],[32,10,32,11],[32,13,32,14],[32,16,32,17],[32,19,32,20],[32,22,32,23]]}
["Variable Costs","Base Year 1",null,null,"Base Year 2",null,null,"Base Year 3",null,null,"Option Year 4",null,null,"Option Year 5",null,null,"Base Term Total",null,null,"Option Years Total",null,null,"5-Year Totals"]
[null,"7/1/2025-6/30/2026",null,null,"7/1/2026-6/30/2027",null,null,"7/1/2027-6/30/2028",null,null,"7/1/2028-6/30/2029",null,null,"7/1/2029-6/30/2030",null,null,"7/1/2025-6/30/2028",null,null,"7/1/2028-6/30/2030",null,null,"7/1/2025-6/30/2030"]
["Item","Units","$ Each","Total","Units","$ Each","Total","Units","$ Each","Total","Units","$ Each","Total","Units","$ Each","Total","Units","$ Each","Total","Units","$ Each","Total","Units","$ Each","Total"]
["Hourly Staff Wages",null,null,{"$f":"'2. Salaries_&_Wages'!E38","v":0},null,null,{"$f":"E4*F4","v":0},null,null,{"$f":"H4*I4","v":0},null,null,{"$f":"K4*L4","v":0},null,null,{"$f":"N4*O4","v":0},{"$f":"IFERROR( AVERAGE(B4,E4,H4),0)","v":0},{"$f":"IFERROR( AVERAGE(C4,F4,I4),0)","v":0},{"$f":" SUM(D4,G4,J4)","v":0},{"$f":"IFERROR(AVERAGE(K4,N4),0)","v":0},{"$f":"IFERROR(AVERAGE(,L4,O4),0)","v":0},{"$f":"SUM(M4,P4)","v":0},{"$f":"IFERROR(AVERAGE(B4,E4,H4,#REF!,#REF!,#REF!,#REF!,K4,N4,#REF!),0)","v":0},{"$f":"IFERROR(AVERAGE(C4,F4,I4,#REF!,#REF!,#REF!,#REF!,L4,O4,#REF!),0)","v":0},{"$f":"S4+V4","v":0}]
[{"$nulls":3},{"$f":"B5*C5","v":0},null,null,{"$f":"E5*F5","v":0},null,null,{"$f":"H5*I5","v":0},null,null,{"$f":"K5*L5","v":0},null,null,{"$f":"N5*O5","v":0},{"$f":"IFERROR( AVERAGE(B5,E5,H5,#REF!,#REF!,#REF!,#REF!),0)","v":0},{"$f":"IFERROR( AVERAGE(C5,F5,I5,#REF!,#REF!,#REF!,#REF!),0)","v":0},{"$f":" SUM(D5,G5,J5)","v":0},{"$f":"IFERROR(AVERAGE(K5,N5,#REF!),0)","v":0},{"$f":"IFERROR(AVERAGE(,L5,O5,#REF!),0)","v":0},{"$f":"SUM(M5,P5)","v":0},{"$f":"IFERROR(AVERAGE(B5,E5,H5,#REF!,#REF!,#REF!,#REF!,K5,N5,#REF!),0)","v":0},{"$f":"IFERROR(AVERAGE(C5,F5,I5,#REF!,#REF!,#REF!,#REF!,L5,O5,#REF!),0)","v":0},{"$f":"S5+V5","v":0}]
[{"$nulls":3},0,null,null,0,null,null,0,null,null,0,null,null,0,{"$f":"IFERROR( AVERAGE(B6,E6,H6,#REF!,#REF!,#REF!,#REF!),0)","v":0},{"$f":"IFERROR( AVERAGE(C6,F6,I6,#REF!,#REF!,#REF!,#REF!),0)","v":0},0,{"$f":"IFERROR(AVERAGE(K6,N6,#REF!),0)","v":0},{"$f":"IFERROR(AVERAGE(,L6,O6,#REF!),0)","v":0},0,{"$f":"IFERROR(AVERAGE(B6,E6,H6,#REF!,#REF!,#REF!,#REF!,K6,N6,#REF!),0)","v":0},{"$f":"IFERROR(AVERAGE(C6,F6,I6,#REF!,#REF!,#REF!,#REF!,L6,O6,#REF!),0)","v":0},0]
[{"$nulls":3},0,null,null,0,null,null,0,null,null,0,null,null,0,{"$f":"IFERROR( AVERAGE(B7,E7,H7,#REF!,#REF!,#REF!,#REF!),0)","v":0},{"$f":"IFERROR( AVERAGE(C7,F7,I7,#REF!,#REF!,#REF!,#REF!),0)","v":0},0,{"$f":"IFERROR(AVERAGE(K7,N7,#REF!),0)","v":0},{"$f":"IFERROR(AVERAGE(,L7,O7,#REF!),0)","v":0},0,{"$f":"IFERROR(AVERAGE(B7,E7,H7,#REF!,#REF!,#REF!,#REF!,K7,N7,#REF!),0)","v":0},{"$f":"IFERROR(AVERAGE(C7,F7,I7,#REF!,#REF!,#REF!,#REF!,L7,O7,#REF!),0)","v":0},0]
[{"$nulls":3},0,null,null,0,null,null,0,null,null,0,null,null,0,{"$f":"IFERROR( AVERAGE(B8,E8,H8,#REF!,#REF!,#REF!,#REF!),0)","v":0},{"$f":"IFERROR( AVERAGE(C8,F8,I8,#REF!,#REF!,#REF!,#REF!),0)","v":0},0,{"$f":"IFERROR(AVERAGE(K8,N8,#REF!),0)","v":0},{"$f":"IFERROR(AVERAGE(,L8,O8,#REF!),0)","v":0},0,{"$f":"IFERROR(AVERAGE(B8,E8,H8,#REF!,#REF!,#REF!,#REF!,K8,N8,#REF!),0)","v":0},{"$f":"IFERROR(AVERAGE(C8,F8,I8,#REF!,#REF!,#REF!,#REF!,L8,O8,#REF!),0)","v":0},0]
[{"$nulls":3},0,null,null,0,null,null,0,null,null,0,null,null,0,{"$f":"IFERROR( AVERAGE(B9,E9,H9,#REF!,#REF!,#REF!,#REF!),0)","v":0},{"$f":"IFERROR( AVERAGE(C9,F9,I9,#REF!,#REF!,#REF!,#REF!),0)","v":0},0,{"$f":"IFERROR(AVERAGE(K9,N9,#REF!),0)","v":0},{"$f":"IFERROR(AVERAGE(,L9,O9,#REF!),0)","v":0},0,{"$f":"IFERROR(AVERAGE(B9,E9,H9,#REF!,#REF!,#REF!,#REF!,K9,N9,#REF!),0)","v":0},{"$f":"IFERROR(AVERAGE(C9,F9,I9,#REF!,#REF!,#REF!,#REF!,L9,O9,#REF!),0)","v":0},0]
[{"$nulls":3},0,null,null,0,null,null,0,null,null,0,null,null,0,{"$f":"IFERROR( AVERAGE(B10,E10,H10,#REF!,#REF!,#REF!,#REF!),0)","v":0},{"$f":"IFERROR( AVERAGE(C10,F10,I10,#REF!,#REF!,#REF!,#REF!),0)","v":0},0,{"$f":"IFERROR(AVERAGE(K10,N10,#REF!),0)","v":0},{"$f":"IFERROR(AVERAGE(,L10,O10,#REF!),0)","v":0},0,{"$f":"IFERROR(AVERAGE(B10,E10,H10,#REF!,#REF!,#REF!,#REF!,K10,N10,#REF!),0)","v":0},{"$f":"IFERROR(AVERAGE(C10,F10,I10,#REF!,#REF!,#REF!,#REF!,L10,O10,#REF!),0)","v":0},0]
{"$rows_left_out":24}
{"sheet":"7. Fixed_Costs","index":7,"n_rows":33,"n_cols":25,"rows_kept":33,"merged":[[0,0,1,0],[0,1,0,3],[0,4,0,6],[0,7,0,9],[0,10,0,12],[0,13,0,15],[0,16,0,18],[0,19,0,21],[0,22,0,24],[1,1,1,3],[1,4,1,6],[1,7,1,9],[1,10,1,12],[1,13,1,15],[1,16,1,18],[1,19,1,21],[1,22,1,24],[32,1,32,2],[32,4,32,5],[32,7,32,8],[32,10,32,11],[32,13,32,14],[32,16,32,17],[32,19,32,20],[32,22,32,23]]}
["Fixed Costs","Base Year 1",null,null,"Base Year 2",null,null,"Base Year 3",null,null,"Option Year 4",null,null,"Option Year 5",null,null,"Base Term Total",null,null,"Option Years Total",null,null,"5-Year Totals"]
[null,"7/1/2025-6/30/2026",null,null,"7/1/2026-6/30/2027",null,null,"7/1/2027-6/30/2028",null,null,"7/1/2028-6/30/2029",null,null,"7/1/2029-6/30/2030",null,null,"7/1/2025-6/30/2028",null,null,"7/1/2028-6/30/2030",null,null,"7/1/2025-6/30/2030"]
["Item","Units","$ Each","Total","Units","$ Each","Total","Units","$ Each","Total","Units","$ Each","Total","Units","$ Each","Total","Units","$ Each","Total","Units","$ Each","Total","Units","$ Each","Total"]
["Salaried Staff Pay & Bonuses",null,null,{"$f":"'2. Salaries_&_Wages'!D38","v":0},null,null,{"$f":"E4*F4","v":0},null,null,{"$f":"H4*I4","v":0},null,null,{"$f":"K4*L4","v":0},null,null,{"$f":"N4*O4","v":0},{"$f":"IFERROR( AVERAGE(B4,E4,H4),0)","v":0},{"$f":"IFERROR( AVERAGE(C4,F4,I4),0)","v":0},{"$f":" SUM(D4,G4,J4)","v":0},{"$f":"IFERROR(AVERAGE(K4,N4),0)","v":0},{"$f":"IFERROR(AVERAGE(L4,O4),0)","v":0},{"$f":"SUM(M4,P4)","v":0},{"$f":"IFERROR(AVERAGE(B4,E4,H4,K4,N4),0)","v":0},{"$f":"IFERROR(AVERAGE(C4,F4,I4,L4,O4),0)","v":0},{"$f":"S4+V4","v":0}]
[{"$nulls":3},{"$f":"B5*C5","v":0},null,null,{"$f":"E5*F5","v":0},null,null,{"$f":"H5*I5","v":0},null,null,{"$f":"K5*L5","v":0},null,null,{"$f":"N5*O5","v":0},{"$f":"IFERROR( AVERAGE(B5,E5,H5),0)","v":0},{"$f":"IFERROR( AVERAGE(C5,F5,I5),0)","v":0},{"$f":" SUM(D5,G5,J5)","v":0},{"$f":"IFERROR(AVERAGE(K5,N5),0)","v":0},{"$f":"IFERROR(AVERAGE(L5,O5),0)","v":0},{"$f":"SUM(M5,P5)","v":0},{"$f":"IFERROR(AVERAGE(B5,E5,H5,K5,N5),0)","v":0},{"$f":"IFERROR(AVERAGE(C5,F5,I5,L5,O5),0)","v":0},{"$f":"S5+V5","v":0}]
[{"$nulls":3},0,null,null,0,null,null,0,null,null,0,null,null,0,0,0,0,0,0,0,0,0,0]
[{"$nulls":3},0,null,null,0,null,null,0,null,null,0,null,null,0,0,0,0,0,0,0,0,0,0]
[{"$nulls":3},0,null,null,0,null,null,0,null,null,0,null,null,0,0,0,0,0,0,0,0,0,0]
[{"$nulls":3},0,null,null,0,null,null,0,null,null,0,null,null,0,0,0,0,0,0,0,0,0,0]
[{"$nulls":3},0,null,null,0,null,null,0,null,null,0,null,null,0,0,0,0,0,0,0,0,0,0]
{"$rows_left_out":24}
{"sheet":"8. Transition & Startup","index":8,"n_rows":33,"n_cols":4,"rows_kept":33,"merged":[[0,0,1,0],[0,1,0,3],[1,1,1,3],[32,1,32,2]]}
["Transition & Startup","Startup Period"]
[null,"3/1/2024-6/30/2025"]
["Item","Units","$ Each","Total"]
[{"$nulls":3},{"$f":"B4*C4","v":0}]
[{"$nulls":3},{"$f":"B5*C5","v":0}]
[{"$nulls":3},{"$f":"B6*C6","v":0}]
[{"$nulls":3},{"$f":"B7*C7","v":0}]
[{"$nulls":3},{"$f":"B8*C8","v":0}]
[{"$nulls":3},{"$f":"B9*C9","v":0}]
[{"$nulls":3},0]
{"$rows_left_out":24}
{"sheet":"9. Summary","index":9,"n_rows":31,"n_cols":10,"rows_kept":31,"merged":[[0,0,1,1],[2,0,2,1],[11,0,11,1],[20,0,20,1],[22,0,22,1],[23,0,23,1],[24,0,24,1],[24,3,24,6],[25,0,25,1],[26,0,26,1],[28,0,28,1],[30,0,30,1]]}
["5-Year Cost Summary",null,"Base Year 1","Base Year 2","Base Year 3","Option Year 4","Option Year 5","Base Term","Option Years","5-Year"]
[null,null,"7/1/2025-6/30/2026","7/1/2026-6/30/2027","7/1/2027-6/30/2028","7/1/2028-6/30/2029","7/1/2029-6/30/2030","7/1/2025-6/30/2028","7/1/2028-6/30/2030","7/1/2025-6/30/2030"]
["Salaries/Wages/Bonuses",null,{"$f":"SUM(C4:C5)","v":0},{"$f":"SUM(D4:D5)","v":0},0,0,0,{"$f":"SUM(H4:H5)","v":0},{"$f":"SUM(I4:I5)","v":0},0]
[null,"Management",{"$f":"SUM('2. Salaries_&_Wages'!U5:U11)","v":0},{"$f":"SUM('2. Salaries_&_Wages'!K5:K11)","v":0},{"$f":"SUM('2. Salaries_&_Wages'!P5:P11)","v":0},{"$f":"SUM('2. Salaries_&_Wages'!U5:U11)","v":0},{"$f":"SUM('2. Salaries_&_Wages'!Z5:Z11)","v":0},{"$f":"SUM(C4:E4)","v":0},{"$f":"SUM(F4:G4)","v":0},{"$f":"SUM(H4:I4)","v":0}]
[null,"Non-Management",{"$f":"SUM(C6:C10)","v":0},{"$f":"SUM(D6:D10)","v":0},0,0,0,{"$f":"SUM(C5:E5)","v":0},{"$f":"SUM(F5:G5)","v":0},{"$f":"SUM(H5:I5)","v":0}]
[null,"Fixed Route Drivers",{"$f":"SUM('2. Salaries_&_Wages'!F13:F14)","v":0},{"$f":"SUM('2. Salaries_&_Wages'!K13:K14)","v":0},{"$f":"SUM('2. Salaries_&_Wages'!P13:P14)","v":0},{"$f":"SUM('2. Salaries_&_Wages'!U13:U14)","v":0},{"$f":"SUM('2. Salaries_&_Wages'!Z13:Z14)","v":0},{"$f":"SUM(C6:E6)","v":0},{"$f":"SUM(F6:G6)","v":0},0]
[null,"Paratransit Drivers",{"$f":"SUM('2. Salaries_&_Wages'!F15:F16)","v":0},{"$f":"SUM('2. Salaries_&_Wages'!K15:K16)","v":0},{"$f":"SUM('2. Salaries_&_Wages'!P15:P16)","v":0},{"$f":"SUM('2. Salaries_&_Wages'!U15:U16)","v":0},{"$f":"SUM('2. Salaries_&_Wages'!Z15:Z16)","v":0},{"$f":"SUM(C7:E7)","v":0},{"$f":"SUM(F7:G7)","v":0},0]
[null,"Dispatch & Road Supervisors",{"$f":"SUM('2. Salaries_&_Wages'!F17:F18)","v":0},{"$f":"SUM('2. Salaries_&_Wages'!K17:K18)","v":0},{"$f":"SUM('2. Salaries_&_Wages'!P17:P18)","v":0},{"$f":"SUM('2. Salaries_&_Wages'!U17:U18)","v":0},{"$f":"SUM('2. Salaries_&_Wages'!Z17:Z18)","v":0},{"$f":"SUM(C8:E8)","v":0},{"$f":"SUM(F8:G8)","v":0},0]
[null,"Customer Service",{"$f":"'2. Salaries_&_Wages'!F19","v":0},{"$f":"'2. Salaries_&_Wages'!K19","v":0},{"$f":"'2. Salaries_&_Wages'!P19","v":0},{"$f":"'2. Salaries_&_Wages'!U19","v":0},{"$f":"'2. Salaries_&_Wages'!Z19","v":0},{"$f":"SUM(C9:E9)","v":0},{"$f":"SUM(F9:G9)","v":0},0]
[null,"Maintenance",{"$f":"SUM('2. Salaries_&_Wages'!F20:F23)","v":0},{"$f":"SUM('2. Salaries_&_Wages'!K20:K23)","v":0},{"$f":"SUM('2. Salaries_&_Wages'!P20:P23)","v":0},{"$f":"SUM('2. Salaries_&_Wages'!U20:U23)","v":0},{"$f":"SUM('2. Salaries_&_Wages'!Z20:Z23)","v":0},{"$f":"SUM(C10:E10)","v":0},{"$f":"SUM(F10:G10)","v":0},0]
{"$rows_left_out":21}